{"text_format":"1","workbook":"xlsx","n_sheets":13,"sheets":["README","Advance_curve","advance_at_lowRPM","VeryLowRPM","EEPROM8","EEPROM16","Accuracy","formules","Calculs","Excel","calibrage","Dwell variable","Version"],"not_rendered":{"charts":4,"images":2,"macros":0,"external_links":0,"defined_names":2,"comments":5,"pivot_tables":0},"unopened":[],"bounds":{"document_bytes":16777216,"sheet_cells":100000,"rows_first":2000,"rows_last":500,"rows_between":2000,"halvings":0,"cell_chars":16384,"cell_head_chars":4096},"cells_cut":0,"cells_raw":0,"read":"whole","date_system":"1900"}

{"sheet":"README","index":0,"n_rows":18,"n_cols":8,"rows_kept":18,"cut":false,"hidden":false,"merged":[]}
[]
[null,"With the values your entered, the CDI behavior will be the following:"]
[]
[null,null,null,null,null,null,null,"Where to change that?"]
[]
["A) ",{"$f":"CONCATENATE(\"5 degrees \",VeryLowRPM!B2)","v":"5 degrees Advance from 91 to 960 RPM"},null,null,null,null,null,"By default (VeryLowRPM tab)"]
[]
["B)",{"$f":"CONCATENATE(\"Flat advance from \",advance_at_lowRPM!X7,\" to \",Advance_curve!D103,\"RPM\")","v":"Flat advance from 960 to 1116RPM"},null,null,null,null,null,"cell I2 in tab \"advance_at_lowRPM\""]
[]
["C)",{"$f":"CONCATENATE(\"Advance curve is freely adjustable from \",Advance_curve!D103, \" to \",Advance_curve!D14,\"RPM\")","v":"Advance curve is freely adjustable from 1116 to 7324RPM"},null,null,null,null,null,"cell B9 in tab \"Advance_curve\""]
{"$rows_left_out":9}
{"sheet":"Advance_curve","index":1,"n_rows":104,"n_cols":24,"rows_kept":104,"cut":false,"hidden":false,"merged":[]}
[null,"14/03/2022",null,"Version 16F628A v7.9r20c2",null,null,null,null,79,20,2]
[]
[null,null,null,null,null,"1 ò",null,null,"incompressible","Step"]
[null,null,null,null,null,"pickup position",null,null,"delay (us)","(us)"]
[null,null,null,null,null,50,"degrees BTDC",null,71,20]
[null,null,null,null,null,null,{"$f":"IF(MAX(J9:J103)>254,\"Some cells warn. Increase STEP cell J5 ?\",\"\")","v":"Some cells warn. Increase STEP cell J5 ?"}]
[null,null,null,null,null,"4 ò",null,null,null,{"$f":"IF(ISERROR(J9),\"Load DECHEX macro\",\"\")","v":""}]
[null,"TIMER1H count","Frq\n(Hz)","RPM","time for 1° (µs)","Advance (degrees)","Delay\nneeded\n(ms)","Delay\nnedeed\n(µs)","Delay\nto add\n(µs)","Values for\nthe map"]
["3 ð",11,{"$f":"(2*$M$24*D9)/(60*$M$25)","v":88.775000000000006},{"$f":"INT((60*1000000)/((B9*256)*(1/(1/$M$30))))","v":10653},{"$f":"((1000*1000*60)/($M$24*D9))/360","v":15.645045214180669},10,{"$f":"(E9*($F$5-F9))/1000","v":0.62580180856722678},{"$f":"E9*($F$5-F9)","v":625.80180856722677},{"$f":"IF($H9>$I$5,INT($H9-$I$5),\"out of range\")","v":554},{"$f":"IF($I9/$J$5>255,255,IF($I9>0.01,INT($I9/$J$5),1))","v":27},{"$f":"IF($I9/$J$5>255,CONCATENATE(\"WARNING: Timing will be more then \",F9,\"°\"),\"\")","v":""},null,null,null,null,null,null,null,null,null,null,null,null,{"$f":"CONCATENATE(J9,\"         ;\",ROUND(D9,0),\"rpm | \",ROUND(F9,1),\"° | \",,ROUND(G9,2),\"ms \")","v":"27         ;10653rpm | 10° | 0,63ms "}]
[null,{"$f":"IF((B9+1)<(95+$B$9),B9+1,\"- End -\")","v":12},81.375,9765,{"$f":"((1000*1000*60)/($M$24*D10))/360","v":17.067759003242877},11,0.66564260112647222,665.64260112647219,{"$f":"IF($H10>$I$5,INT($H10-$I$5),\"out of range\")","v":594},{"$f":"IF($I10/$J$5>255,255,IF($I10>0.01,INT($I10/$J$5),1))","v":29},"",null,null,null,null,null,null,null,null,null,null,null,null,"29         ;9765rpm | 11° | 0,67ms "]
{"$rows_left_out":95}
{"sheet":"advance_at_lowRPM","index":2,"n_rows":49,"n_cols":24,"rows_kept":49,"cut":false,"hidden":false,"merged":[[0,6,0,7]]}
[null,null,null,null,null,null,"delay =",null,4.4000000000000004,"us"]
[null,"Advance at low RPM",null,{"$f":"CONCATENATE(\"from \",X7,\" to\")","v":"from 960 to"},{"$f":"CONCATENATE(ROUNDDOWN(Advance_curve!D103,0),\" RPM\")","v":"1116 RPM"},null,null,"multiplier",15,null,null,null,null,null,{"$f":"Advance_curve!$F$5","v":50},"pickup pos"]
[null,null,null,null,null,null,null,null,null,null,null,null,null,null,{"$f":"Advance_curve!$B9","v":11},"tmr count min"]
[null,null,null,null,null,null,null,"Prescaler =",{"$f":"Advance_curve!M30","v":2},null,null,null,null,null,null,null,null,null,null,null,{"$f":"IF(Q8<255,\"=(360000/P8)*T8\",0)","v":0}]
[null,null,null,null,null,null,null,"Cylinder(s) =",{"$f":"Advance_curve!M24","v":1}]
[null,null,null,null,null,null,null,"Strokes =",{"$f":"Advance_curve!M25","v":4},null,null,null,null,"Frq","RPM","periode","timer1h","Delay","1°","Avance","Avance",null,null,"mini:"]
[null,null,null,null,null,null,null,"RPM mini =",{"$f":"IF(Advance_curve!M30=1,\"336\",IF(Advance_curve!M30=2,\"168\",IF(Advance_curve!M30=4,\"84\",IF(Advance_curve!M30=8,\"42\",\"False\"))))","v":"168"},null,null,null,null,"Hz",null,"µs",null,"µs","us","degres","degres",null,null,{"$f":"MIN(X8:X49)","v":960}]
[null,null,null,null,null,null,null,null,null,null,null,null,null,1,{"$f":"IF(N8=\"End\",\" \",(N8*60*$I$6)/(2*$I$5))","v":120},{"$f":"1000000/N8","v":1000000},{"$f":"IF(N8=\"End\",\" \",INT(P8/($I$4*255)))","v":1960},{"$f":" ($I$1 *$Q8*$I$2)","v":129360},{"$f":"P8/360","v":2777.7777777777778},{"$f":"R8/S8","v":46.569600000000001},{"$f":"IF($Q8<255,Advance_curve!$F$5-T8,\"0\")","v":"0"},{"$f":"IF($Q8<255,\" \",\"TMR1h>255\")","v":"TMR1h>255"},null,{"$f":"IF($Q8<255,O8,\" \")","v":" "}]
[null,null,null,null,null,null,null,null,null,null,null,null,null,{"$f":"IF(N8<Advance_curve!$C$103,N8+1,\"End\")","v":2},240,{"$f":"1000000/N9","v":500000},980,{"$f":" ($I$1 *$Q9*$I$2)","v":64680},{"$f":"P9/360","v":1388.8888888888889},{"$f":"R9/S9","v":46.569600000000001},{"$f":"IF($Q9<255,Advance_curve!$F$5-T9,\"0\")","v":"0"},{"$f":"IF($Q9<255,\" \",\"TMR1h>255\")","v":"TMR1h>255"},null," "]
[null,null,null,null,null,null,null,null,null,null,null,null,null,{"$f":"IF(N9<Advance_curve!$C$103,N9+1,\"End\")","v":3},360,333333.33333333331,653,43098.000000000007,925.92592592592587,46.545840000000013,{"$f":"IF($Q10<255,Advance_curve!$F$5-T10,\"0\")","v":"0"},"TMR1h>255",null," "]
{"$rows_left_out":40}
{"sheet":"VeryLowRPM","index":3,"n_rows":9,"n_cols":7,"rows_kept":9,"cut":false,"hidden":false,"merged":[]}
[]
[null,{"$f":"CONCATENATE(\"Advance from \",E9,\" to \",advance_at_lowRPM!X7,\" RPM\")","v":"Advance from 91 to 960 RPM"}]
[null,null,null,null,null,null,"Si une periode entre 2 pkp fait 131ms pour 360°"]
[null,"Prescaler",{"$f":"Advance_curve!M30","v":2},null,null,null,"alors 50° (pkp position) sont parcourus en 131/360*50 = 18ms"]
[null,"clock",4,null,null,null,"Si on attend 18ms x TMR1DEB on spark pile au TDC."]
[null,"periode TMR1L",{"$f":"4*C4/C5","v":2},null,5,"debords max"]
[null,"TMR1",{"$f":"65536*C6/1000","v":131.072},"ms",{"$f":"E6*C7","v":655.36},"ms"]
[null,"pkp position",{"$f":"Advance_curve!F5","v":50},"deg",{"$f":"1000/E7","v":1.52587890625},"Hz"]
[null,"Time from pickup position to TDC",{"$f":"(C7/360)*C8","v":18.204444444444444},"ms",{"$f":"INT(60*E8)","v":91},"rpm"]

{"sheet":"EEPROM8","index":4,"n_rows":130,"n_cols":26,"rows_kept":130,"cut":false,"hidden":false,"merged":[[18,1,18,2]]}
[null,null,null,null,null,null,null,null,null,null,null,null,"INTEL 8HEX format",null,"RAW format",null,null,null,null,null,null,null,null,null,null,"MCH Format"]
["Address\n(hex)","Bytes\n in\nRow","Address\nStart\n(dec)","+0","+1","+2","+3","+4","+5","+6","+7",null,":020000040000FA",null,null,null,"sum[dec]","sum[hex]","LSB","two's\ncomplement [dec]","two's\ncomplement +1","cksum"]
[{"$f":"DEC2HEX(C3,4)","v":"0000"},8,0,{"$f":"Advance_curve!J9","v":27},{"$f":"Advance_curve!J10","v":29},{"$f":"Advance_curve!J11","v":31},{"$f":"Advance_curve!J12","v":33},{"$f":"Advance_curve!J13","v":34},{"$f":"Advance_curve!J14","v":37},{"$f":"Advance_curve!J15","v":39},{"$f":"Advance_curve!J16","v":42},null,{"$f":"\":\"&DEC2HEX(B3,2)&DEC2HEX(C3,4)&\"00\"&DEC2HEX(D3,2)&DEC2HEX(E3,2)&DEC2HEX(F3,2)&DEC2HEX(G3,2)&DEC2HEX(H3,2)&DEC2HEX(I3,2)&DEC2HEX(J3,2)&DEC2HEX(K3,2)&V3","v":":080000001B1D1F212225272AE8"},null,{"$f":"DEC2HEX(D3,2)&\" \"&DEC2HEX(E3,2)&\" \"&DEC2HEX(F3,2)&\" \"&DEC2HEX(G3,2)&\"   \"&DEC2HEX(H3,2)&\" \"&DEC2HEX(I3,2)&\" \"&DEC2HEX(J3,2)&\" \"&DEC2HEX(K3,2)","v":"1B 1D 1F 21   22 25 27 2A"},null,{"$f":"SUM(B3:K3)","v":280},{"$f":"DEC2HEX(Q3)","v":"118"},{"$f":"RIGHT(R3,2)","v":"18"},{"$f":"255-HEX2DEC(S3)","v":231},{"$f":"T3+1","v":232},{"$f":"IF(U3=256,\"00\",DEC2HEX(U3,2))","v":"E8"},null,null,null,{"$f":"DEC2HEX(D3,2)","v":"1B"}]
["0008",8,8,{"$f":"Advance_curve!J17","v":45},{"$f":"Advance_curve!J18","v":47},{"$f":"Advance_curve!J19","v":50},{"$f":"Advance_curve!J20","v":52},{"$f":"Advance_curve!J21","v":55},{"$f":"Advance_curve!J22","v":57},{"$f":"Advance_curve!J23","v":60},{"$f":"Advance_curve!J24","v":63},null,{"$f":"\":\"&DEC2HEX(B4,2)&DEC2HEX(C4,4)&\"00\"&DEC2HEX(D4,2)&DEC2HEX(E4,2)&DEC2HEX(F4,2)&DEC2HEX(G4,2)&DEC2HEX(H4,2)&DEC2HEX(I4,2)&DEC2HEX(J4,2)&DEC2HEX(K4,2)&V4","v":":080008002D2F323437393C3F43"},null,{"$f":"DEC2HEX(D4,2)&\" \"&DEC2HEX(E4,2)&\" \"&DEC2HEX(F4,2)&\" \"&DEC2HEX(G4,2)&\"   \"&DEC2HEX(H4,2)&\" \"&DEC2HEX(I4,2)&\" \"&DEC2HEX(J4,2)&\" \"&DEC2HEX(K4,2)","v":"2D 2F 32 34   37 39 3C 3F"},null,{"$f":"SUM(B4:K4)","v":445},{"$f":"DEC2HEX(Q4)","v":"1BD"},{"$f":"RIGHT(R4,2)","v":"BD"},{"$f":"255-HEX2DEC(S4)","v":66},{"$f":"T4+1","v":67},"43",null,null,null,{"$f":"DEC2HEX(E3,2)","v":"1D"}]
["0010",8,16,{"$f":"Advance_curve!J25","v":65},{"$f":"Advance_curve!J26","v":68},{"$f":"Advance_curve!J27","v":70},{"$f":"Advance_curve!J28","v":73},{"$f":"Advance_curve!J29","v":75},{"$f":"Advance_curve!J30","v":78},{"$f":"Advance_curve!J31","v":80},{"$f":"Advance_curve!J32","v":83},null,{"$f":"\":\"&DEC2HEX(B5,2)&DEC2HEX(C5,4)&\"00\"&DEC2HEX(D5,2)&DEC2HEX(E5,2)&DEC2HEX(F5,2)&DEC2HEX(G5,2)&DEC2HEX(H5,2)&DEC2HEX(I5,2)&DEC2HEX(J5,2)&DEC2HEX(K5,2)&V5","v":":08001000414446494B4E505398"},null,"41 44 46 49   4B 4E 50 53",null,616,"268","68",151,152,"98",null,null,null,{"$f":"DEC2HEX(F3,2)","v":"1F"}]
["0018",8,24,{"$f":"Advance_curve!J33","v":86},{"$f":"Advance_curve!J34","v":88},{"$f":"Advance_curve!J35","v":91},{"$f":"Advance_curve!J36","v":93},{"$f":"Advance_curve!J37","v":96},{"$f":"Advance_curve!J38","v":98},{"$f":"Advance_curve!J39","v":101},{"$f":"Advance_curve!J40","v":103},null,":0800180056585B5D60626567EC",null,"56 58 5B 5D   60 62 65 67",null,788,"314","14",235,236,"EC",null,null,null,{"$f":"DEC2HEX(G3,2)","v":"21"}]
["0020",8,32,{"$f":"Advance_curve!J41","v":106},{"$f":"Advance_curve!J42","v":109},{"$f":"Advance_curve!J43","v":111},{"$f":"Advance_curve!J44","v":114},{"$f":"Advance_curve!J45","v":116},{"$f":"Advance_curve!J46","v":119},{"$f":"Advance_curve!J47","v":121},{"$f":"Advance_curve!J48","v":124},null,":080020006A6D6F727477797C40",null,"6A 6D 6F 72   74 77 79 7C",null,960,"3C0","C0",63,64,"40",null,null,null,{"$f":"DEC2HEX(H3,2)","v":"22"}]
["0028",8,40,{"$f":"Advance_curve!J49","v":127},{"$f":"Advance_curve!J50","v":129},{"$f":"Advance_curve!J51","v":132},{"$f":"Advance_curve!J52","v":134},{"$f":"Advance_curve!J53","v":137},{"$f":"Advance_curve!J54","v":139},{"$f":"Advance_curve!J55","v":142},{"$f":"Advance_curve!J56","v":144},null,":080028007F818486898B8E9094",null,"7F 81 84 86   89 8B 8E 90",null,1132,"46C","6C",147,148,"94",null,null,null,{"$f":"DEC2HEX(I3,2)","v":"25"}]
["0030",8,48,{"$f":"Advance_curve!J57","v":147},{"$f":"Advance_curve!J58","v":150},{"$f":"Advance_curve!J59","v":152},{"$f":"Advance_curve!J60","v":155},{"$f":"Advance_curve!J61","v":157},{"$f":"Advance_curve!J62","v":160},{"$f":"Advance_curve!J63","v":162},{"$f":"Advance_curve!J64","v":165},null,":080030009396989B9DA0A2A5E8",null,"93 96 98 9B   9D A0 A2 A5",null,1304,"518","18",231,232,"E8",null,null,null,{"$f":"DEC2HEX(J3,2)","v":"27"}]
["0038",8,56,{"$f":"Advance_curve!J65","v":167},{"$f":"Advance_curve!J66","v":170},{"$f":"Advance_curve!J67","v":173},{"$f":"Advance_curve!J68","v":175},{"$f":"Advance_curve!J69","v":178},{"$f":"Advance_curve!J70","v":180},{"$f":"Advance_curve!J71","v":183},{"$f":"Advance_curve!J72","v":185},null,":08003800A7AAADAFB2B4B7B93D",null,"A7 AA AD AF   B2 B4 B7 B9",null,1475,"5C3","C3",60,61,"3D",null,null,null,{"$f":"DEC2HEX(K3,2)","v":"2A"}]
{"$rows_left_out":121}
{"sheet":"EEPROM16","index":5,"n_rows":50,"n_cols":25,"rows_kept":50,"cut":false,"hidden":false,"merged":[]}
[null,null,null,null,null,null,null,null,null,null,null,null,null,null,"INTEL 16HEX format",null,"RAW format"]
[]
["Bytes\n in\nRow","Address\nMSB (hex)","Address\nLSB (hex)","Address Start (MSB)","Address\nStart\n(LSB)","+0","+1","+2","+3","+4","+5","+6","+7",null,":020000040000FA",null,null,null,"sum[dec]","sum[hex]","LSB","two's\ncomplement [dec]","two's\ncomplement +1","cksum","cksum corrigé"]
[16,42,{"$f":"DEC2HEX(E4,2)","v":"00"},224,0,{"$f":"Advance_curve!J9","v":27},{"$f":"Advance_curve!J10","v":29},{"$f":"Advance_curve!J11","v":31},{"$f":"Advance_curve!J12","v":33},{"$f":"Advance_curve!J13","v":34},{"$f":"Advance_curve!J14","v":37},{"$f":"Advance_curve!J15","v":39},{"$f":"Advance_curve!J16","v":42},null,{"$f":"\":\"&DEC2HEX(A4,2)&B4&C4&\"00\"&DEC2HEX(F4,2)&\"00\"&DEC2HEX(G4,2)&\"00\"&DEC2HEX(H4,2)&\"00\"&DEC2HEX(I4,2)&\"00\"&DEC2HEX(J4,2)&\"00\"&DEC2HEX(K4,2)&\"00\"&DEC2HEX(L4,2)&\"00\"&DEC2HEX(M4,2)&\"00\"&Y4","v":":104200001B001D001F0021002200250027002A0000"},null,{"$f":"DEC2HEX(F4,2)&\" \"&DEC2HEX(G4,2)&\" \"&DEC2HEX(H4,2)&\" \"&DEC2HEX(I4,2)&\"   \"&DEC2HEX(J4,2)&\" \"&DEC2HEX(K4,2)&\" \"&DEC2HEX(L4,2)&\" \"&DEC2HEX(M4,2)","v":"1B 1D 1F 21   22 25 27 2A"},null,{"$f":"SUM(D4:M4)","v":496},{"$f":"DEC2HEX(S4)","v":"1F0"},{"$f":"RIGHT(T4,2)","v":"F0"},{"$f":"255-HEX2DEC(U4)","v":15},{"$f":"V4+1","v":16},{"$f":"IF(W4=256,\"00\",DEC2HEX(W4,2))","v":"10"},{"$f":"RIGHT(DEC2HEX(HEX2DEC(X4)-16,2),2)","v":"00"}]
[16,42,{"$f":"DEC2HEX(E5,2)","v":"10"},224,16,{"$f":"Advance_curve!J17","v":45},{"$f":"Advance_curve!J18","v":47},{"$f":"Advance_curve!J19","v":50},{"$f":"Advance_curve!J20","v":52},{"$f":"Advance_curve!J21","v":55},{"$f":"Advance_curve!J22","v":57},{"$f":"Advance_curve!J23","v":60},{"$f":"Advance_curve!J24","v":63},null,{"$f":"\":\"&DEC2HEX(A5,2)&B5&C5&\"00\"&DEC2HEX(F5,2)&\"00\"&DEC2HEX(G5,2)&\"00\"&DEC2HEX(H5,2)&\"00\"&DEC2HEX(I5,2)&\"00\"&DEC2HEX(J5,2)&\"00\"&DEC2HEX(K5,2)&\"00\"&DEC2HEX(L5,2)&\"00\"&DEC2HEX(M5,2)&\"00\"&Y5","v":":104210002D002F0032003400370039003C003F0053"},null,"2D 2F 32 34   37 39 3C 3F",null,{"$f":"SUM(D5:M5)","v":669},{"$f":"DEC2HEX(S5)","v":"29D"},{"$f":"RIGHT(T5,2)","v":"9D"},{"$f":"255-HEX2DEC(U5)","v":98},99,"63","53"]
[16,42,"20",224,32,{"$f":"Advance_curve!J25","v":65},{"$f":"Advance_curve!J26","v":68},{"$f":"Advance_curve!J27","v":70},{"$f":"Advance_curve!J28","v":73},{"$f":"Advance_curve!J29","v":75},{"$f":"Advance_curve!J30","v":78},{"$f":"Advance_curve!J31","v":80},{"$f":"Advance_curve!J32","v":83},null,{"$f":"\":\"&DEC2HEX(A6,2)&B6&C6&\"00\"&DEC2HEX(F6,2)&\"00\"&DEC2HEX(G6,2)&\"00\"&DEC2HEX(H6,2)&\"00\"&DEC2HEX(I6,2)&\"00\"&DEC2HEX(J6,2)&\"00\"&DEC2HEX(K6,2)&\"00\"&DEC2HEX(L6,2)&\"00\"&DEC2HEX(M6,2)&\"00\"&Y6","v":":1042200041004400460049004B004E0050005300A0"},null,"41 44 46 49   4B 4E 50 53",null,{"$f":"SUM(D6:M6)","v":848},"350","50",175,176,"B0","A0"]
[16,42,"30",224,48,{"$f":"Advance_curve!J33","v":86},{"$f":"Advance_curve!J34","v":88},{"$f":"Advance_curve!J35","v":91},{"$f":"Advance_curve!J36","v":93},{"$f":"Advance_curve!J37","v":96},{"$f":"Advance_curve!J38","v":98},{"$f":"Advance_curve!J39","v":101},{"$f":"Advance_curve!J40","v":103},null,":10423000560058005B005D006000620065006700EC",null,"56 58 5B 5D   60 62 65 67",null,1028,"404","04",251,252,"FC","EC"]
[16,42,"40",224,64,{"$f":"Advance_curve!J41","v":106},{"$f":"Advance_curve!J42","v":109},{"$f":"Advance_curve!J43","v":111},{"$f":"Advance_curve!J44","v":114},{"$f":"Advance_curve!J45","v":116},{"$f":"Advance_curve!J46","v":119},{"$f":"Advance_curve!J47","v":121},{"$f":"Advance_curve!J48","v":124},null,":104240006A006D006F0072007400770079007C0038",null,"6A 6D 6F 72   74 77 79 7C",null,1208,"4B8","B8",71,72,"48","38"]
[16,42,"50",224,80,{"$f":"Advance_curve!J49","v":127},{"$f":"Advance_curve!J50","v":129},{"$f":"Advance_curve!J51","v":132},{"$f":"Advance_curve!J52","v":134},{"$f":"Advance_curve!J53","v":137},{"$f":"Advance_curve!J54","v":139},{"$f":"Advance_curve!J55","v":142},{"$f":"Advance_curve!J56","v":144},null,":104250007F0081008400860089008B008E00900084",null,"7F 81 84 86   89 8B 8E 90",null,1388,"56C","6C",147,148,"94","84"]
[16,42,"60",224,96,{"$f":"Advance_curve!J57","v":147},{"$f":"Advance_curve!J58","v":150},{"$f":"Advance_curve!J59","v":152},{"$f":"Advance_curve!J60","v":155},{"$f":"Advance_curve!J61","v":157},{"$f":"Advance_curve!J62","v":160},{"$f":"Advance_curve!J63","v":162},{"$f":"Advance_curve!J64","v":165},null,":104260009300960098009B009D00A000A200A500D0",null,"93 96 98 9B   9D A0 A2 A5",null,1568,"620","20",223,224,"E0","D0"]
{"$rows_left_out":41}
{"sheet":"Accuracy","index":6,"n_rows":16,"n_cols":3,"rows_kept":16,"cut":false,"hidden":false,"merged":[]}
["CYLINDRE:",1,"cyl"]
["STROKES",2,"stk"]
["ACCURACY",3.4,"us"]
[]
["RPM","ERROR"]
[0,0]
[1000,{"$f":"$B$3/((1000*(60*$B$2)/(2*$B$1*$A7))/0.36)","v":2.0399999999999998E-2}]
[2000,{"$f":"$B$3/((1000*(60*$B$2)/(2*$B$1*$A8))/0.36)","v":4.0799999999999996E-2}]
[3000,6.1199999999999997E-2]
[4000,8.1599999999999992E-2]
{"$rows_left_out":7}
{"sheet":"formules","index":7,"n_rows":51,"n_cols":15,"rows_kept":51,"cut":false,"hidden":false,"merged":[[16,8,16,9],[16,11,16,12],[16,13,16,14],[17,13,17,14],[0,8,0,9],[48,2,48,5],[48,6,48,9],[49,6,49,9],[49,2,49,5],[50,2,50,9]]}
[null,null,"TEMPS","CYLINDRE","RPM","FREQUENCE","PERIODE","PERIODE","1°",null,"durée =","degrés","relatif\npickup"]
[null,null,"Nbr","Nbr","tr/mn","Hz","ms","pour 2cyl 2tps","ms","us","us",null,{"$f":"Advance_curve!F5","v":50}]
[null,null,2,1,10000,{"$f":"(2*$D$3*$E$3)/(60*$C$3)","v":166.66666666666666},{"$f":"1000*(60*$C$3)/(2*$D$3*$E$3)","v":6},{"$f":"1000*60/$E$3","v":6},{"$f":"G3/360","v":1.6666666666666666E-2},{"$f":"G3/0.36","v":16.666666666666668},1884,{"$f":"K3/J3","v":113.03999999999999},{"$f":"L3-Advance_curve!F5","v":63.039999999999992}]
[]
[null,null,null,null,{"$f":"(60*$F$5*$C$3)/(2*$D$3)","v":120},2,{"$f":"1000*(60*$C$3)/(2*$D$3*$E$5)","v":500},{"$f":"1000*60/$E$5","v":500},{"$f":"G5/360","v":1.3888888888888888},{"$f":"G5/0.36","v":1388.8888888888889},null,"FRQ = (2*CYL*RPM) / (60*TEMPS)"]
[null,null,null,null,null,null,null,null,null,null,null,"RPM = (60*FRQ*TEMPS) / ( 2*CYL)"]
[null,null,null,null,"Délai","=>","Délai","Avance",null,null,null,"1degré = (1000*1000*60*CYL) / ( 2*TEMPS*RPM)/360"]
[null,null,null,null,"us",null,"°","°"]
[null,null,null,null,60800,null,{"$f":"E9/J3","v":3647.9999999999995},{"$f":"Advance_curve!F5 -G9","v":-3597.9999999999995}]
[]
{"$rows_left_out":42}
{"sheet":"Calculs","index":8,"n_rows":38,"n_cols":6,"rows_kept":38,"cut":false,"hidden":false,"merged":[]}
[]
["- Tant que pickup est bas (=0) 99% du temps, on met la valeur du TIMER0 dans la variable PERL (PERiode Low)"]
["- Chaque fois que TIMER0 provoque une INTerruption de debordement lorsqu'il arrive a 255,  dans la routine d'interruption on incremente TMR0H (TIMER0 High)"]
["- Quand le pickup est haut (=1) (pulse) :"]
["- on memorise la valeur de TMR0H (Nbr de debordements de TIMER0), dans PERH (PERiode High)"]
["- et on memorise aussi la valeur du TIMER0 dans la variable PERL."]
["- puis on RAZ les timers,"]
[]
["- Ainsi la durée ecoulé entre 2 pickups est stockée dans PERL et PERH.   Soit : (PERH x 255 ) + PERL"]
[]
{"$rows_left_out":29}
{"sheet":"Excel","index":9,"n_rows":10,"n_cols":3,"rows_kept":10,"cut":false,"hidden":false,"merged":[]}
[]
[]
["Conversion de valeurs: ",null,"=SI(I2=2;2;(SI(I2=3;3;(SI(I2=4;4;(SI(I2=5;5;(SI(I2=6;6)))))))))"]
[]
["Liste deroulante: ",null,"Donnees> Validite des donnees"]
[]
[]
["les graphes n'affichent pas la valeur #N/A  , utiliser #N/A pour faire disparaitre les points du graphe"]
[]
["Pour afficher les liens d'une cellule: selectionner la > Formule > Reperer les antécédents ou dependants "]
{"$rows_left_out":1}
{"sheet":"calibrage","index":10,"n_rows":33,"n_cols":24,"rows_kept":33,"cut":false,"hidden":false,"merged":[]}
[null,null,null,null,null,"avec pickup\n de 50us","avec DAC\n duree proportionnelle",null,"mesure \nN°1\noscillo","correction1",null,"mesure \nN°2\noscillo",null,null,"mesure N°2\noscillo",null,null,"mesure\n N°2\noscillo",null,null,"mesure\n N°3\noscillo"]
[null,"RPM","HZ","ms","us","L","L",null,"ms","L",null,null,null,null,"ms",null,null,"ms",null,null,"ms"]
[1,1000,{"$f":"(2*formules!$D$3*B3)/(60*formules!$C$3)","v":16.666666666666668},{"$f":"1000*(60*formules!$C$3)/(2*formules!$D$3*B3)","v":60},{"$f":"D3*1000","v":60000},null,62000,{"$f":"CONCATENATE($X3,\" = \",G3)","v":"FREQUENCE[1] = 62000"},70.400000000000006,52800,{"$f":"CONCATENATE($X3,\" = \",J3)","v":"FREQUENCE[1] = 52800"},60.8,52000,{"$f":"CONCATENATE($X3,\" = \",M3)","v":"FREQUENCE[1] = 52000"},60,52000,{"$f":"CONCATENATE($X3,\" = \",P3)","v":"FREQUENCE[1] = 52000"},60,52000,{"$f":"CONCATENATE($X3,\" = \",S3)","v":"FREQUENCE[1] = 52000"},null,52000,{"$f":"CONCATENATE($X3,\" = \",V3)","v":"FREQUENCE[1] = 52000"},{"$f":"CONCATENATE(\"FREQUENCE[\",A3,\"]\")","v":"FREQUENCE[1]"}]
[2,1500,{"$f":"(2*formules!$D$3*B4)/(60*formules!$C$3)","v":25},{"$f":"1000*(60*formules!$C$3)/(2*formules!$D$3*B4)","v":40},{"$f":"D4*1000","v":40000},null,34500,{"$f":"CONCATENATE(X4,\" = \",G4)","v":"FREQUENCE[2] = 34500"},null,0,{"$f":"CONCATENATE($X4,\" = \",J4)","v":"FREQUENCE[2] = 0"},null,0,{"$f":"CONCATENATE($X4,\" = \",M4)","v":"FREQUENCE[2] = 0"},null,0,{"$f":"CONCATENATE($X4,\" = \",P4)","v":"FREQUENCE[2] = 0"},null,0,{"$f":"CONCATENATE($X4,\" = \",S4)","v":"FREQUENCE[2] = 0"},null,0,{"$f":"CONCATENATE($X4,\" = \",V4)","v":"FREQUENCE[2] = 0"},"FREQUENCE[2]"]
[3,2000,{"$f":"(2*formules!$D$3*B5)/(60*formules!$C$3)","v":33.333333333333336},{"$f":"1000*(60*formules!$C$3)/(2*formules!$D$3*B5)","v":30},30000,27320,26670,"FREQUENCE[3] = 26670",31.6,24700,"FREQUENCE[3] = 24700",30,24700,"FREQUENCE[3] = 24700",29.4,25200,"FREQUENCE[3] = 25200",30,25200,"FREQUENCE[3] = 25200",null,25200,"FREQUENCE[3] = 25200","FREQUENCE[3]"]
[4,2500,{"$f":"(2*formules!$D$3*B6)/(60*formules!$C$3)","v":41.666666666666664},{"$f":"1000*(60*formules!$C$3)/(2*formules!$D$3*B6)","v":24},24000,21870,21300,"FREQUENCE[4] = 21300",null,0,"FREQUENCE[4] = 0",null,0,"FREQUENCE[4] = 0",null,0,"FREQUENCE[4] = 0",null,0,"FREQUENCE[4] = 0",null,0,"FREQUENCE[4] = 0","FREQUENCE[4]"]
[5,3000,{"$f":"(2*formules!$D$3*B7)/(60*formules!$C$3)","v":50},{"$f":"1000*(60*formules!$C$3)/(2*formules!$D$3*B7)","v":20},20000,18190,17670,"FREQUENCE[5] = 17670",21.6,16360,"FREQUENCE[5] = 16360",20.399999999999999,16040,"FREQUENCE[5] = 16040",19.7,16280,"FREQUENCE[5] = 16280",20,16280,"FREQUENCE[5] = 16280",null,16280,"FREQUENCE[5] = 16280","FREQUENCE[5]"]
[6,3500,{"$f":"(2*formules!$D$3*B8)/(60*formules!$C$3)","v":58.333333333333336},{"$f":"1000*(60*formules!$C$3)/(2*formules!$D$3*B8)","v":17.142857142857142},17142.857142857141,15600,15070,"FREQUENCE[6] = 15070",null,0,"FREQUENCE[6] = 0",null,0,"FREQUENCE[6] = 0",null,0,"FREQUENCE[6] = 0",null,0,"FREQUENCE[6] = 0",null,0,"FREQUENCE[6] = 0","FREQUENCE[6]"]
[7,4000,{"$f":"(2*formules!$D$3*B9)/(60*formules!$C$3)","v":66.666666666666671},{"$f":"1000*(60*formules!$C$3)/(2*formules!$D$3*B9)","v":15},15000,13580,13100,"FREQUENCE[7] = 13100",16.600000000000001,11800,"FREQUENCE[7] = 11800",15,11800,"FREQUENCE[7] = 11800",14.7,12040,"FREQUENCE[7] = 12040",15.3,11800,"FREQUENCE[7] = 11800",null,11800,"FREQUENCE[7] = 11800","FREQUENCE[7]"]
[8,4500,{"$f":"(2*formules!$D$3*B10)/(60*formules!$C$3)","v":75},{"$f":"1000*(60*formules!$C$3)/(2*formules!$D$3*B10)","v":13.333333333333334},13333.333333333334,12149,11610,"FREQUENCE[8] = 11610",null,0,"FREQUENCE[8] = 0",null,0,"FREQUENCE[8] = 0",null,0,"FREQUENCE[8] = 0",null,0,"FREQUENCE[8] = 0",null,0,"FREQUENCE[8] = 0","FREQUENCE[8]"]
{"$rows_left_out":24}
{"sheet":"Dwell variable","index":11,"n_rows":98,"n_cols":5,"rows_kept":98,"cut":false,"hidden":false,"merged":[]}
[]
[null,null,null,"coef:","DWELL = PERIODE * 50"]
[null,{"$f":"Advance_curve!B8","v":"TIMER1H count"},null,50]
[null,{"$f":"Advance_curve!B9","v":11},{"$f":"$D$3*Advance_curve!B9","v":550},"µs"]
[null,{"$f":"Advance_curve!B10","v":12},{"$f":"$D$3*Advance_curve!B10","v":600}]
[null,{"$f":"Advance_curve!B11","v":13},{"$f":"$D$3*Advance_curve!B11","v":650}]
[null,{"$f":"Advance_curve!B12","v":14},{"$f":"$D$3*Advance_curve!B12","v":700}]
[null,{"$f":"Advance_curve!B13","v":15},{"$f":"$D$3*Advance_curve!B13","v":750}]
[null,{"$f":"Advance_curve!B14","v":16},{"$f":"$D$3*Advance_curve!B14","v":800}]
[null,{"$f":"Advance_curve!B15","v":17},{"$f":"$D$3*Advance_curve!B15","v":850}]
{"$rows_left_out":89}
{"sheet":"Version","index":12,"n_rows":35,"n_cols":2,"rows_kept":35,"cut":false,"hidden":false,"merged":[]}
[]
[]
[]
["v7.9r13c2","[HARD] Correction RA1 forcé a 1, car pullup R5 sur PCB"]
["v7.9r13c3","[XLS] Valeur de dwell passe de 2 choix (500,1000) a 6 choix (500,1000,2000,3000,4000,5000)."]
["v7.9r14c0","[SOFT,XLS] Ajout d'une valeur de dwell \"AUTO\" pour lequel la durée de dwell est proportionnelle a PERIODE."]
["v7.9r14c1","[SOFT] Code protection OFF"]
["v7.9r15c0","[XLS] La valeur d'avance affichée dans l'onglet \"advance_at_lowRPM\" ne prenait pas en compte la position du pickup, c'était donc une valeur RELATIVE, pas ABSOLUE. Multiplicateur peut descendre a 1 (soft OK)"]
[null,"[SOFT] si JP2 a la masse alors PIC bypass la courbe d'avance et envoi spark dés que detection front descendant du pickup"]
[null,"[SOFT] RB3 (ex TP2) n'était pas forcé en OUTPUT"]
{"$rows_left_out":25}