{"text_format":"1","workbook":"xlsx","n_sheets":13,"sheets":["README","Advance_curve","advance_at_lowRPM","VeryLowRPM","EEPROM8","EEPROM16","Accuracy","formules","Calculs","Excel","calibrage","Dwell variable","Version"],"not_rendered":{"charts":4,"images":2,"macros":0,"external_links":0,"defined_names":2,"comments":5,"pivot_tables":0},"unopened":[],"bounds":{"document_bytes":16777216,"sheet_cells":100000,"rows_first":2000,"rows_last":500,"rows_between":2000,"halvings":0,"cell_chars":16384,"cell_head_chars":4096},"cells_cut":0,"cells_raw":0,"read":"whole","date_system":"1900"}

{"sheet":"README","index":0,"n_rows":18,"n_cols":8,"rows_kept":18,"cut":false,"hidden":false,"merged":[]}
[]
[null,"With the values your entered, the CDI behavior will be the following:"]
[]
[null,null,null,null,null,null,null,"Where to change that?"]
[]
["A) ",{"$f":"CONCATENATE(\"5 degrees \",VeryLowRPM!B2)","v":"5 degrees Advance from 91 to 960 RPM"},null,null,null,null,null,"By default (VeryLowRPM tab)"]
[]
["B)",{"$f":"CONCATENATE(\"Flat advance from \",advance_at_lowRPM!X7,\" to \",Advance_curve!D103,\"RPM\")","v":"Flat advance from 960 to 1116RPM"},null,null,null,null,null,"cell I2 in tab \"advance_at_lowRPM\""]
[]
["C)",{"$f":"CONCATENATE(\"Advance curve is freely adjustable from \",Advance_curve!D103, \" to \",Advance_curve!D14,\"RPM\")","v":"Advance curve is freely adjustable from 1116 to 7324RPM"},null,null,null,null,null,"cell B9 in tab \"Advance_curve\""]
[]
[null,"Eprom values to burn into the microcontroller",null,null,null,null,null,"cells O18 to 035 in tab \"Advance_curve\""]
[]
[null,{"$f":"CONCATENATE(\"No spark when engine goes above \",Advance_curve!D9,\"RPM - Act as absolute rev-limiter\")","v":"No spark when engine goes above 10653RPM - Act as absolute rev-limiter"},null,null,null,null,null,"cell B9 in tab \"Advance_curve\""]
[]
[null,"Optional rev-limiter activated by JP2 jumper",null,null,null,null,null,"cell M30 in tab \"Advance_curve\""]
[]
[null,"ONLY YELLOW CELLS ARE CHANGEABLE"]

{"sheet":"Advance_curve","index":1,"n_rows":104,"n_cols":24,"rows_kept":104,"cut":false,"hidden":false,"merged":[]}
[null,"14/03/2022",null,"Version 16F628A v7.9r20c2",null,null,null,null,79,20,2]
[]
[null,null,null,null,null,"1 ò",null,null,"incompressible","Step"]
[null,null,null,null,null,"pickup position",null,null,"delay (us)","(us)"]
[null,null,null,null,null,50,"degrees BTDC",null,71,20]
[null,null,null,null,null,null,{"$f":"IF(MAX(J9:J103)>254,\"Some cells warn. Increase STEP cell J5 ?\",\"\")","v":"Some cells warn. Increase STEP cell J5 ?"}]
[null,null,null,null,null,"4 ò",null,null,null,{"$f":"IF(ISERROR(J9),\"Load DECHEX macro\",\"\")","v":""}]
[null,"TIMER1H count","Frq\n(Hz)","RPM","time for 1° (µs)","Advance (degrees)","Delay\nneeded\n(ms)","Delay\nnedeed\n(µs)","Delay\nto add\n(µs)","Values for\nthe map"]
["3 ð",11,{"$f":"(2*$M$24*D9)/(60*$M$25)","v":88.775000000000006},{"$f":"INT((60*1000000)/((B9*256)*(1/(1/$M$30))))","v":10653},{"$f":"((1000*1000*60)/($M$24*D9))/360","v":15.645045214180669},10,{"$f":"(E9*($F$5-F9))/1000","v":0.62580180856722678},{"$f":"E9*($F$5-F9)","v":625.80180856722677},{"$f":"IF($H9>$I$5,INT($H9-$I$5),\"out of range\")","v":554},{"$f":"IF($I9/$J$5>255,255,IF($I9>0.01,INT($I9/$J$5),1))","v":27},{"$f":"IF($I9/$J$5>255,CONCATENATE(\"WARNING: Timing will be more then \",F9,\"°\"),\"\")","v":""},null,null,null,null,null,null,null,null,null,null,null,null,{"$f":"CONCATENATE(J9,\"         ;\",ROUND(D9,0),\"rpm | \",ROUND(F9,1),\"° | \",,ROUND(G9,2),\"ms \")","v":"27         ;10653rpm | 10° | 0,63ms "}]
[null,{"$f":"IF((B9+1)<(95+$B$9),B9+1,\"- End -\")","v":12},81.375,9765,{"$f":"((1000*1000*60)/($M$24*D10))/360","v":17.067759003242877},11,0.66564260112647222,665.64260112647219,{"$f":"IF($H10>$I$5,INT($H10-$I$5),\"out of range\")","v":594},{"$f":"IF($I10/$J$5>255,255,IF($I10>0.01,INT($I10/$J$5),1))","v":29},"",null,null,null,null,null,null,null,null,null,null,null,null,"29         ;9765rpm | 11° | 0,67ms "]
[null,{"$f":"IF((B10+1)<(95+$B$9),B10+1,\"- End -\")","v":13},75.11666666666666,9014,18.489756674802159,12,0.70261075364248204,702.610753642482,{"$f":"IF($H11>$I$5,INT($H11-$I$5),\"out of range\")","v":631},31,"",null,null,null,null,null,null,null,null,null,null,null,null,"31         ;9014rpm | 12° | 0,7ms "]
[null,14,69.75,8370,19.912385503783355,13,0.73675826363998409,736.75826363998408,665,33,"",null,null,null,null,null,null,null,null,null,null,null,null,"33         ;8370rpm | 13° | 0,74ms "]
[null,15,65.099999999999994,7812,21.334698754053591,14,0.76804915514592931,768.04915514592926,697,34,"",null,null,null,null,null,null,null,null,null,null,null,null,"34         ;7812rpm | 14° | 0,77ms "]
[null,16,61.033333333333331,7324,22.756235208447116,14,0.81922446750409617,819.2244675040962,748,37,"",null,null,null,null,null,null,null,null,null,null,null,null,"37         ;7324rpm | 14° | 0,82ms "]
[null,17,57.44166666666667,6893,24.179118912906816,14,0.87044828086464532,870.44828086464531,799,39,"",null,null,null,null,null,null,null,null,null,null,null,null,"39         ;6893rpm | 14° | 0,87ms "]
[null,18,54.25,6510,25.601638504864312,14,0.92165898617511521,921.65898617511516,850,42,"",null,null,null,null,null,null,null,null,null,null,null,null,"42         ;6510rpm | 14° | 0,92ms "]
[null,19,51.391666666666666,6167,27.025566185611588,14,0.97292038268201708,972.92038268201713,901,45,"",null,null,"EEprom data ð",{"$f":"EEPROM16!O1","v":"INTEL 16HEX format"},null,null,null,{"$f":"EEPROM8!M1","v":"INTEL 8HEX format"},null,null,null,null,"45         ;6167rpm | 14° | 0,97ms "]
[null,20,48.825000000000003,5859,28.446265005404793,14,1.0240655401945726,1024.0655401945726,953,47,"",null,null,null,null,null,{"$f":"EEPROM8!O1","v":"RAW format"},null,null,null,null,null,null,"47         ;5859rpm | 14° | 1,02ms "]
[null,21,46.5,5580,29.868578255675029,14,1.075268817204301,1075.2688172043011,1004,50,"",null,null,null,{"$f":"EEPROM16!O3","v":":020000040000FA"},null,null,null,{"$f":"EEPROM8!M2","v":":020000040000FA"},null,null,null,null,"50         ;5580rpm | 14° | 1,08ms "]
[null,22,44.383333333333333,5326,31.2930279133809,14,1.1265490048817124,1126.5490048817123,1055,52,"",null,null,null,{"$f":"EEPROM16!O4","v":":104200001B001D001F0021002200250027002A0000"},null,{"$f":"EEPROM8!O3","v":"1B 1D 1F 21   22 25 27 2A"},null,{"$f":"EEPROM8!M3","v":":080000001B1D1F212225272AE8"},null,null,null,null,"52         ;5326rpm | 14° | 1,13ms "]
[null,23,42.458333333333336,5095,32.711808963035658,14,1.1776251226692838,1177.6251226692837,1106,55,"",null,null,null,{"$f":"EEPROM16!O5","v":":104210002D002F0032003400370039003C003F0053"},null,{"$f":"EEPROM8!O4","v":"2D 2F 32 34   37 39 3C 3F"},null,{"$f":"EEPROM8!M4","v":":080008002D2F323437393C3F43"},null,null,null,null,"55         ;5095rpm | 14° | 1,18ms "]
[null,24,40.68333333333333,4882,34.139014065273798,14,1.2290045063498567,1229.0045063498567,1158,57,"",null,"2 ò",null,{"$f":"EEPROM16!O6","v":":1042200041004400460049004B004E0050005300A0"},null,{"$f":"EEPROM8!O5","v":"41 44 46 49   4B 4E 50 53"},null,{"$f":"EEPROM8!M5","v":":08001000414446494B4E505398"},null,null,null,null,"57         ;4882rpm | 14° | 1,23ms "]
[null,25,39.05833333333333,4687,35.559348552734519,14,1.2801365478984426,1280.1365478984426,1209,60,"",null,null,null,{"$f":"EEPROM16!O7","v":":10423000560058005B005D006000620065006700EC"},null,{"$f":"EEPROM8!O6","v":"56 58 5B 5D   60 62 65 67"},null,{"$f":"EEPROM8!M6","v":":0800180056585B5D60626567EC"},null,null,null,null,"60         ;4687rpm | 14° | 1,28ms "]
[null,26,37.55833333333333,4507,36.979513349604318,14,1.3312624805857554,1331.2624805857554,1260,63,"","Number of cylinder",1,null,{"$f":"EEPROM16!O8","v":":104240006A006D006F0072007400770079007C0038"},null,{"$f":"EEPROM8!O7","v":"6A 6D 6F 72   74 77 79 7C"},null,{"$f":"EEPROM8!M7","v":":080020006A6D6F727477797C40"},null,null,null,null,"63         ;4507rpm | 14° | 1,33ms "]
[null,27,36.166666666666664,4340,38.402457757296467,14,1.3824884792626728,1382.4884792626729,1311,65,"",null,{"$f":"IF(M26=\"4 no wasted spark\",4,2)","v":4},null,{"$f":"EEPROM16!O9","v":":104250007F0081008400860089008B008E00900084"},null,{"$f":"EEPROM8!O8","v":"7F 81 84 86   89 8B 8E 90"},null,{"$f":"EEPROM8!M8","v":":080028007F818486898B8E9094"},null,null,null,null,"65         ;4340rpm | 14° | 1,38ms "]
[null,28,34.875,4185,39.82477100756671,14,1.4336917562724016,1433.6917562724016,1362,68,"","Strokes","4 no wasted spark",null,{"$f":"EEPROM16!O10","v":":104260009300960098009B009D00A000A200A500D0"},null,{"$f":"EEPROM8!O9","v":"93 96 98 9B   9D A0 A2 A5"},null,{"$f":"EEPROM8!M9","v":":080030009396989B9DA0A2A5E8"},null,null,null,null,"68         ;4185rpm | 14° | 1,43ms "]
[null,29,33.666666666666664,4040,41.254125412541256,14,1.4851485148514854,1485.1485148514853,1414,70,"",null,null,null,{"$f":"EEPROM16!O11","v":":10427000A700AA00AD00AF00B200B400B700B9001D"},null,{"$f":"EEPROM8!O10","v":"A7 AA AD AF   B2 B4 B7 B9"},null,{"$f":"EEPROM8!M10","v":":08003800A7AAADAFB2B4B7B93D"},null,null,null,null,"70         ;4040rpm | 14° | 1,49ms "]
[null,30,32.549999999999997,3906,42.669397508107181,14,1.5360983102918586,1536.0983102918585,1465,73,"",null,null,null,{"$f":"EEPROM16!O12","v":":10428000BC00BF00C100C400C600C900CB00CE0068"},null,{"$f":"EEPROM8!O11","v":"BC BF C1 C4   C6 C9 CB CE"},null,{"$f":"EEPROM8!M11","v":":08004000BCBFC1C4C6C9CBCE90"},null,null,null,null,"73         ;3906rpm | 14° | 1,54ms "]
[null,31,31.5,3780,44.091710758377424,14,1.5873015873015872,1587.3015873015872,1516,75,"",null,null,null,{"$f":"EEPROM16!O13","v":":10429000D100D300D600D800DB00DD00E000E200B4"},null,{"$f":"EEPROM8!O12","v":"D1 D3 D6 D8   DB DD E0 E2"},null,{"$f":"EEPROM8!M12","v":":08004800D1D3D6D8DBDDE0E2E4"},null,null,null,null,"75         ;3780rpm | 14° | 1,59ms "]
[null,32,30.516666666666666,3662,45.512470416894232,14,1.6384489350081923,1638.4489350081924,1567,78,"","prescaler",2,null,{"$f":"EEPROM16!O14","v":":1042A000E500E800EA00ED00EF00F200F400F70000"},null,{"$f":"EEPROM8!O13","v":"E5 E8 EA ED   EF F2 F4 F7"},null,{"$f":"EEPROM8!M13","v":":08005000E5E8EAEDEFF2F4F738"},null,null,null,null,"78         ;3662rpm | 14° | 1,64ms "]
[null,33,29.591666666666665,3551,46.935135642542008,14,1.6896648831315124,1689.6648831315124,1618,80,"",null,null,null,{"$f":"EEPROM16!O15","v":":1042B000FA00FC00FF00FF00FF00FF00FF0000006F"},null,{"$f":"EEPROM8!O14","v":"FA FC FF FF   FF FF FF 00"},null,{"$f":"EEPROM8!M14","v":":08005800FAFCFFFFFFFFFF00AF"},null,null,null,null,"80         ;3551rpm | 14° | 1,69ms "]
[null,34,28.716666666666665,3446,48.365254401238154,14,1.7411491584445735,1741.1491584445735,1670,83,"","output width","Auto","us",{"$f":"EEPROM16!O16","v":":1042C0000000000000000000000000000000000050"},null,{"$f":"EEPROM8!O15","v":"00 00 00 00   00 00 00 00"},null,{"$f":"EEPROM8!M15","v":":08006000000000000000000098"},null,null,null,null,"83         ;3446rpm | 14° | 1,74ms "]
[null,35,27.9,3348,49.780963759458388,14,1.7921146953405018,1792.1146953405018,1721,86,"",null,null,null,{"$f":"EEPROM16!O17","v":":1042D0000000000000000000000000000000000040"},null,{"$f":"EEPROM8!O16","v":"00 00 00 00   00 00 00 00"},null,{"$f":"EEPROM8!M16","v":":08006800000000000000000090"},null,null,null,null,"86         ;3348rpm | 14° | 1,79ms "]
[null,36,27.125,3255,51.203277009728623,14,1.8433179723502304,1843.3179723502303,1772,88,"","Optional Rev Limit",9765,"RPM",{"$f":"EEPROM16!O18","v":":1042E0004F0014000200320014001400140001005C"},null,{"$f":"EEPROM8!O17","v":"4F 14 02 32   14 14 14 01"},null,{"$f":"EEPROM8!M17","v":":080070004F14023214141401B4"},null,null,null,null,"88         ;3255rpm | 14° | 1,84ms "]
[null,37,26.391666666666666,3167,52.626039364277446,14,1.8945374171139882,1894.5374171139881,1823,91,"",null,{"$f":"IF(M36=\"no\",0,1)","v":1},null,{"$f":"EEPROM16!O19","v":":1042F00012000C00630002000F0014000B00690006"},null,{"$f":"EEPROM8!O18","v":"12 0C 63 02   0F 14 0B 69"},null,{"$f":"EEPROM8!M18","v":":08007800120C63020F140B6966"},null,null,null,null,"91         ;3167rpm | 14° | 1,89ms "]
[null,38,25.691666666666666,3083,54.059898367391071,14,1.9461563412260785,1946.1563412260784,1875,93,"","LED diagnostic","yes",null,{"$f":"EEPROM16!O20","v":":00000001FF"},null,null,null,{"$f":"EEPROM8!M19","v":":00000001FF"},null,null,null,null,"93         ;3083rpm | 14° | 1,95ms "]
[null,39,25.033333333333335,3004,55.481580115401691,14,1.997336884154461,1997.3368841544609,1926,96,"",null,null,null,null,null,null,null,null,null,null,null,null,"96         ;3004rpm | 14° | 2ms "]
[null,40,24.408333333333335,2929,56.902241948332758,14,2.0484807101399793,2048.4807101399792,1977,98,"",null,null,null,null,null,null,null,null,null,null,null,null,"98         ;2929rpm | 14° | 2,05ms "]
[null,41,23.816666666666666,2858,58.315838581758804,14,2.099370188943317,2099.3701889433169,2028,101,"",null,null,null,null,null,null,null,null,null,null,null,null,"101         ;2858rpm | 14° | 2,1ms "]
[null,42,23.25,2790,59.737156511350058,14,2.150537634408602,2150.5376344086021,2079,103,"",null,null,null,null,null,null,null,null,null,null,null,null,"103         ;2790rpm | 14° | 2,15ms "]
[null,43,{"$f":"(2*$M$24*D41)/(60*$M$25)","v":22.708333333333332},{"$f":"INT((60*1000000)/((B41*256)*(1/(1/$M$30))))","v":2725},61.162079510703357,14,{"$f":"(E41*($F$5-F41))/1000","v":2.2018348623853208},{"$f":"E41*($F$5-F41)","v":2201.8348623853208},2130,106,"",null,null,null,null,null,null,null,null,null,null,null,null,{"$f":"CONCATENATE(J41,\"         ;\",ROUND(D41,0),\"rpm | \",ROUND(F41,1),\"° | \",,ROUND(G41,2),\"ms \")","v":"106         ;2725rpm | 14° | 2,2ms "}]
[null,44,22.191666666666666,2663,62.5860558267618,14,2.2530980097634248,2253.0980097634247,2182,109,"",null,null,null,null,null,null,null,null,null,null,null,null,"109         ;2663rpm | 14° | 2,25ms "]
[null,45,21.7,2604,64.004096262160786,14,2.3041474654377883,2304.1474654377885,2233,111,"",null,null,null,null,null,null,null,null,null,null,null,null,"111         ;2604rpm | 14° | 2,3ms "]
[null,46,21.225000000000001,2547,65.436461196178499,14,2.3557126030624258,2355.7126030624258,2284,114,"",null,null,null,null,null,null,null,null,null,null,null,null,"114         ;2547rpm | 14° | 2,36ms "]
[null,47,20.774999999999999,2493,66.853857467575878,14,2.4067388688327314,2406.7388688327314,2335,116,"",null,null,null,null,null,null,null,null,null,null,null,null,"116         ;2493rpm | 14° | 2,41ms "]
[null,48,20.341666666666665,2441,68.278028130547597,14,2.4580090126997134,2458.0090126997134,2387,119,"",null,null,null,null,null,null,null,null,null,null,null,null,"119         ;2441rpm | 14° | 2,46ms "]
[null,49,19.925000000000001,2391,69.705841349505079,14,2.509410288582183,2509.4102885821831,2438,121,"",null,null,null,null,null,null,null,null,null,null,null,null,"121         ;2391rpm | 14° | 2,51ms "]
[null,50,19.524999999999999,2343,71.133873950775367,14,2.5608194622279132,2560.8194622279134,2489,124,"",null,null,null,null,null,null,null,null,null,null,null,null,"124         ;2343rpm | 14° | 2,56ms "]
[null,51,19.141666666666666,2297,72.558409519663329,14,2.6121027427078798,2612.1027427078798,2541,127,"",null,null,null,null,null,null,null,null,null,null,null,null,"127         ;2297rpm | 14° | 2,61ms "]
[null,52,18.774999999999999,2253,73.975440153868917,14,2.6631158455392812,2663.1158455392811,2592,129,"",null,null,null,null,null,null,null,null,null,null,null,null,"129         ;2253rpm | 14° | 2,66ms "]
[null,53,18.425000000000001,2211,75.38067239559777,14,2.7137042062415198,2713.7042062415198,2642,132,"",null,null,null,null,null,null,null,null,null,null,null,null,"132         ;2211rpm | 14° | 2,71ms "]
[null,54,18.083333333333332,2170,76.804915514592935,14,2.7649769585253456,2764.9769585253457,2693,134,"",null,null,null,null,null,null,null,null,null,null,null,null,"134         ;2170rpm | 14° | 2,76ms "]
[null,55,17.75,2130,78.247261345852891,14,2.816901408450704,2816.9014084507039,2745,137,"",null,null,null,null,null,null,null,null,null,null,null,null,"137         ;2130rpm | 14° | 2,82ms "]
[null,56,17.433333333333334,2092,79.668578712555771,14,2.8680688336520079,2868.0688336520079,2797,139,"",null,null,null,null,null,null,null,null,null,null,null,null,"139         ;2092rpm | 14° | 2,87ms "]
[null,57,17.125,2055,81.103000811030014,14,2.9197080291970807,2919.7080291970806,2848,142,"",null,null,null,null,null,null,null,null,null,null,null,null,"142         ;2055rpm | 14° | 2,92ms "]
[null,58,16.833333333333332,2020,82.508250825082513,14,2.9702970297029707,2970.2970297029706,2899,144,"",null,null,null,null,null,null,null,null,null,null,null,null,"144         ;2020rpm | 14° | 2,97ms "]
[null,59,16.55,1986,83.920778784827121,14,3.0211480362537761,3021.1480362537764,2950,147,"",null,null,null,null,null,null,null,null,null,null,null,null,"147         ;1986rpm | 14° | 3,02ms "]
[null,60,16.274999999999999,1953,85.338795016214362,14,3.0721966205837172,3072.196620583717,3001,150,"",null,null,null,null,null,null,null,null,null,null,null,null,"150         ;1953rpm | 14° | 3,07ms "]
[null,61,16.008333333333333,1921,86.760367863959743,14,3.1233732431025509,3123.373243102551,3052,152,"",null,null,null,null,null,null,null,null,null,null,null,null,"152         ;1921rpm | 14° | 3,12ms "]
[null,62,15.75,1890,88.183421516754848,14,3.1746031746031744,3174.6031746031745,3103,155,"",null,null,null,null,null,null,null,null,null,null,null,null,"155         ;1890rpm | 14° | 3,17ms "]
[null,63,15.5,1860,89.605734767025098,14,3.2258064516129035,3225.8064516129034,3154,157,"",null,null,null,null,null,null,null,null,null,null,null,null,"157         ;1860rpm | 14° | 3,23ms "]
[null,64,15.258333333333333,1831,91.024940833788463,14,3.2768978700163847,3276.8978700163848,3205,160,"",null,null,null,null,null,null,null,null,null,null,null,null,"160         ;1831rpm | 14° | 3,28ms "]
[null,65,15.016666666666667,1802,92.489826119126903,14,3.3296337402885685,3329.6337402885683,3258,162,"",null,null,null,null,null,null,null,null,null,null,null,null,"162         ;1802rpm | 14° | 3,33ms "]
[null,66,14.791666666666666,1775,93.896713615023472,14,3.380281690140845,3380.2816901408451,3309,165,"",null,null,null,null,null,null,null,null,null,null,null,null,"165         ;1775rpm | 14° | 3,38ms "]
[null,67,14.574999999999999,1749,95.292548122736804,14,3.4305317324185247,3430.5317324185248,3359,167,"",null,null,null,null,null,null,null,null,null,null,null,null,"167         ;1749rpm | 14° | 3,43ms "]
[null,68,14.358333333333333,1723,96.730508802476308,14,3.482298316889147,3482.2983168891469,3411,170,"",null,null,null,null,null,null,null,null,null,null,null,null,"170         ;1723rpm | 14° | 3,48ms "]
[null,69,14.15,1698,98.154691794267762,14,3.5335689045936398,3533.5689045936397,3462,173,"",null,null,null,null,null,null,null,null,null,null,null,null,"173         ;1698rpm | 14° | 3,53ms "]
[null,70,13.95,1674,99.561927518916775,14,3.5842293906810037,3584.2293906810037,3513,175,"",null,null,null,null,null,null,null,null,null,null,null,null,"175         ;1674rpm | 14° | 3,58ms "]
[null,71,13.75,1650,101.010101010101,14,3.6363636363636362,3636.363636363636,3565,178,"",null,null,null,null,null,null,null,null,null,null,null,null,"178         ;1650rpm | 14° | 3,64ms "]
[null,72,13.558333333333334,1627,102.43802499487811,14,3.687768899815612,3687.7688998156118,3616,180,"",null,null,null,null,null,null,null,null,null,null,null,null,"180         ;1627rpm | 14° | 3,69ms "]
[null,73,13.375,1605,103.84215991692628,14,3.7383177570093458,3738.3177570093458,3667,183,"",null,null,null,null,null,null,null,null,null,null,null,null,"183         ;1605rpm | 14° | 3,74ms "]
[null,74,13.191666666666666,1583,105.28532322594229,14,3.7902716361339226,3790.2716361339226,3719,185,"",null,null,null,null,null,null,null,null,null,null,null,null,"185         ;1583rpm | 14° | 3,79ms "]
[null,75,{"$f":"(2*$M$24*D73)/(60*$M$25)","v":13.016666666666667},{"$f":"INT((60*1000000)/((B73*256)*(1/(1/$M$30))))","v":1562},106.70081092616304,14,{"$f":"(E73*($F$5-F73))/1000","v":3.8412291933418699},{"$f":"E73*($F$5-F73)","v":3841.2291933418696},3770,188,{"$f":"IF($I73/$J$5>255,CONCATENATE(\"WARNING: Timing will be more then \",F73,\"°\"),\"\")","v":""},null,null,null,null,null,null,null,null,null,null,null,null,{"$f":"CONCATENATE(J73,\"         ;\",ROUND(D73,0),\"rpm | \",ROUND(F73,1),\"° | \",,ROUND(G73,2),\"ms \")","v":"188         ;1562rpm | 14° | 3,84ms "}]
[null,76,12.841666666666667,1541,{"$f":"((1000*1000*60)/($M$24*D74))/360","v":108.15487778498809},14,3.8935756002595712,3893.5756002595713,3822,{"$f":"IF($I74/$J$5>255,255,IF($I74>0.01,INT($I74/$J$5),1))","v":191},"",null,null,null,null,null,null,null,null,null,null,null,null,"191         ;1541rpm | 14° | 3,89ms "]
[null,{"$f":"IF((B74+1)<(95+$B$9),B74+1,\"- End -\")","v":77},12.675000000000001,1521,109.57703265395574,14,3.9447731755424065,3944.7731755424065,{"$f":"IF($H75>$I$5,INT($H75-$I$5),\"out of range\")","v":3873},193,"",null,null,null,null,null,null,null,null,null,null,null,null,"193         ;1521rpm | 14° | 3,94ms "]
[null,78,12.516666666666667,1502,110.96316023080338,14,3.994673768308922,3994.6737683089218,3923,196,"",null,null,null,null,null,null,null,null,null,null,null,null,"196         ;1502rpm | 14° | 3,99ms "]
[null,79,12.358333333333333,1483,112.38480557428635,14,4.0458530006743088,4045.8530006743085,3974,198,"",null,null,null,null,null,null,null,null,null,null,null,null,"198         ;1483rpm | 14° | 4,05ms "]
[null,80,12.2,1464,113.84335154826957,14,4.0983606557377046,4098.3606557377043,4027,201,"",null,null,null,null,null,null,null,null,null,null,null,null,"201         ;1464rpm | 14° | 4,1ms "]
[null,81,12.05,1446,115.2604887044721,14,4.1493775933609962,4149.3775933609959,4078,203,"",null,null,null,null,null,null,null,null,null,null,null,null,"203         ;1446rpm | 14° | 4,15ms "]
[null,82,11.908333333333333,1429,116.63167716351761,14,4.1987403778866339,4198.7403778866337,4127,206,"",null,null,null,null,null,null,null,null,null,null,null,null,"206         ;1429rpm | 14° | 4,2ms "]
[null,83,11.758333333333333,1411,118.11953697141507,14,4.2523033309709426,4252.3033309709426,4181,209,"",null,null,null,null,null,null,null,null,null,null,null,null,"209         ;1411rpm | 14° | 4,25ms "]
[null,84,11.625,1395,119.47431302270012,14,4.301075268817204,4301.0752688172042,4230,211,"",null,null,null,null,null,null,null,null,null,null,null,null,"211         ;1395rpm | 14° | 4,3ms "]
[null,85,11.483333333333333,1378,120.94823415578134,14,4.3541364296081282,4354.1364296081283,4283,214,"",null,null,null,null,null,null,null,null,null,null,null,null,"214         ;1378rpm | 14° | 4,35ms "]
[null,86,11.35,1362,122.36906510034264,14,4.4052863436123353,4405.2863436123353,4334,216,"",null,null,null,null,null,null,null,null,null,null,null,null,"216         ;1362rpm | 14° | 4,41ms "]
[null,87,11.216666666666667,1346,123.82367508667656,14,4.4576523031203559,4457.652303120356,4386,219,"",null,null,null,null,null,null,null,null,null,null,null,null,"219         ;1346rpm | 14° | 4,46ms "]
[null,88,11.091666666666667,1331,125.21913348359628,14,4.5078888054094657,4507.8888054094659,4436,221,"",null,null,null,null,null,null,null,null,null,null,null,null,"221         ;1331rpm | 14° | 4,51ms "]
[null,89,10.966666666666667,1316,126.64640324214793,14,4.5592705167173255,4559.2705167173253,4488,224,"",null,null,null,null,null,null,null,null,null,null,null,null,"224         ;1316rpm | 14° | 4,56ms "]
[null,90,10.85,1302,128.00819252432157,14,4.6082949308755765,4608.2949308755769,4537,226,"",null,null,null,null,null,null,null,null,null,null,null,null,"226         ;1302rpm | 14° | 4,61ms "]
[null,91,10.725,1287,129.5001295001295,14,4.6620046620046622,4662.0046620046624,4591,229,"",null,null,null,null,null,null,null,null,null,null,null,null,"229         ;1287rpm | 14° | 4,66ms "]
[null,92,10.608333333333333,1273,130.92432573972243,14,4.713275726630008,4713.2757266300077,4642,232,"",null,null,null,null,null,null,null,null,null,null,null,null,"232         ;1273rpm | 14° | 4,71ms "]
[null,93,10.5,1260,132.27513227513228,14,4.7619047619047628,4761.9047619047624,4690,234,"",null,null,null,null,null,null,null,null,null,null,null,null,"234         ;1260rpm | 14° | 4,76ms "]
[null,94,10.383333333333333,1246,133.76136971642589,14,4.815409309791332,4815.4093097913319,4744,237,"",null,null,null,null,null,null,null,null,null,null,null,null,"237         ;1246rpm | 14° | 4,82ms "]
[null,95,10.275,1233,135.17166801838334,14,4.8661800486618008,4866.1800486618004,4795,239,"",null,null,null,null,null,null,null,null,null,null,null,null,"239         ;1233rpm | 14° | 4,87ms "]
[null,96,10.166666666666666,1220,136.61202185792351,14,4.918032786885246,4918.0327868852464,4847,242,"",null,null,null,null,null,null,null,null,null,null,null,null,"242         ;1220rpm | 14° | 4,92ms "]
[null,97,10.066666666666666,1208,137.9690949227373,14,4.9668874172185422,4966.8874172185424,4895,244,"",null,null,null,null,null,null,null,null,null,null,null,null,"244         ;1208rpm | 14° | 4,97ms "]
[null,98,9.9583333333333339,1195,139.47001394700141,14,5.0209205020920509,5020.9205020920508,4949,247,"",null,null,null,null,null,null,null,null,null,null,null,null,"247         ;1195rpm | 14° | 5,02ms "]
[null,99,9.8583333333333325,1183,140.88475626937165,14,5.0718512256973787,5071.851225697379,5000,250,"",null,null,null,null,null,null,null,null,null,null,null,null,"250         ;1183rpm | 14° | 5,07ms "]
[null,100,9.7583333333333329,1171,142.32849416453172,14,5.1238257899231421,5123.8257899231421,5052,252,"",null,null,null,null,null,null,null,null,null,null,null,null,"252         ;1171rpm | 14° | 5,12ms "]
[null,101,9.6666666666666661,1160,143.67816091954023,14,5.1724137931034484,5172.4137931034484,5101,255,"WARNING: Timing will be more then 14°",null,null,null,null,null,null,null,null,null,null,null,null,"255         ;1160rpm | 14° | 5,17ms "]
[null,102,9.5666666666666664,1148,145.18002322880372,14,5.2264808362369344,5226.480836236934,5155,255,"WARNING: Timing will be more then 14°",null,null,null,null,null,null,null,null,null,null,null,null,"255         ;1148rpm | 14° | 5,23ms "]
[null,103,9.4749999999999996,1137,146.5845793022574,14,5.2770448548812663,5277.0448548812665,5206,255,"WARNING: Timing will be more then 14°",null,null,null,null,null,null,null,null,null,null,null,null,"255         ;1137rpm | 14° | 5,28ms "]
[null,104,9.3833333333333329,1126,148.01657785671995,14,5.3285968028419184,5328.5968028419184,5257,255,"WARNING: Timing will be more then 14°",null,null,null,null,null,null,null,null,null,null,null,null,"255         ;1126rpm | 14° | 5,33ms "]
[null,105,9.3000000000000007,1116,149.34289127837513,14,5.376344086021505,5376.3440860215051,5305,255,{"$f":"IF($I103/$J$5>255,CONCATENATE(\"WARNING: Timing will be more then \",F103,\"°\"),\"\")","v":"WARNING: Timing will be more then 14°"},null,null,null,null,null,null,null,null,null,null,null,null,"255         ;1116rpm | 14° | 5,38ms "]
[null,null,null,null,null,null,null,null,null,null,null,null,null,null,null,null,null,null,null,null,null,null,null,"         ;0rpm | 0° | 0ms "]

{"sheet":"advance_at_lowRPM","index":2,"n_rows":49,"n_cols":24,"rows_kept":49,"cut":false,"hidden":false,"merged":[[0,6,0,7]]}
[null,null,null,null,null,null,"delay =",null,4.4000000000000004,"us"]
[null,"Advance at low RPM",null,{"$f":"CONCATENATE(\"from \",X7,\" to\")","v":"from 960 to"},{"$f":"CONCATENATE(ROUNDDOWN(Advance_curve!D103,0),\" RPM\")","v":"1116 RPM"},null,null,"multiplier",15,null,null,null,null,null,{"$f":"Advance_curve!$F$5","v":50},"pickup pos"]
[null,null,null,null,null,null,null,null,null,null,null,null,null,null,{"$f":"Advance_curve!$B9","v":11},"tmr count min"]
[null,null,null,null,null,null,null,"Prescaler =",{"$f":"Advance_curve!M30","v":2},null,null,null,null,null,null,null,null,null,null,null,{"$f":"IF(Q8<255,\"=(360000/P8)*T8\",0)","v":0}]
[null,null,null,null,null,null,null,"Cylinder(s) =",{"$f":"Advance_curve!M24","v":1}]
[null,null,null,null,null,null,null,"Strokes =",{"$f":"Advance_curve!M25","v":4},null,null,null,null,"Frq","RPM","periode","timer1h","Delay","1°","Avance","Avance",null,null,"mini:"]
[null,null,null,null,null,null,null,"RPM mini =",{"$f":"IF(Advance_curve!M30=1,\"336\",IF(Advance_curve!M30=2,\"168\",IF(Advance_curve!M30=4,\"84\",IF(Advance_curve!M30=8,\"42\",\"False\"))))","v":"168"},null,null,null,null,"Hz",null,"µs",null,"µs","us","degres","degres",null,null,{"$f":"MIN(X8:X49)","v":960}]
[null,null,null,null,null,null,null,null,null,null,null,null,null,1,{"$f":"IF(N8=\"End\",\" \",(N8*60*$I$6)/(2*$I$5))","v":120},{"$f":"1000000/N8","v":1000000},{"$f":"IF(N8=\"End\",\" \",INT(P8/($I$4*255)))","v":1960},{"$f":" ($I$1 *$Q8*$I$2)","v":129360},{"$f":"P8/360","v":2777.7777777777778},{"$f":"R8/S8","v":46.569600000000001},{"$f":"IF($Q8<255,Advance_curve!$F$5-T8,\"0\")","v":"0"},{"$f":"IF($Q8<255,\" \",\"TMR1h>255\")","v":"TMR1h>255"},null,{"$f":"IF($Q8<255,O8,\" \")","v":" "}]
[null,null,null,null,null,null,null,null,null,null,null,null,null,{"$f":"IF(N8<Advance_curve!$C$103,N8+1,\"End\")","v":2},240,{"$f":"1000000/N9","v":500000},980,{"$f":" ($I$1 *$Q9*$I$2)","v":64680},{"$f":"P9/360","v":1388.8888888888889},{"$f":"R9/S9","v":46.569600000000001},{"$f":"IF($Q9<255,Advance_curve!$F$5-T9,\"0\")","v":"0"},{"$f":"IF($Q9<255,\" \",\"TMR1h>255\")","v":"TMR1h>255"},null," "]
[null,null,null,null,null,null,null,null,null,null,null,null,null,{"$f":"IF(N9<Advance_curve!$C$103,N9+1,\"End\")","v":3},360,333333.33333333331,653,43098.000000000007,925.92592592592587,46.545840000000013,{"$f":"IF($Q10<255,Advance_curve!$F$5-T10,\"0\")","v":"0"},"TMR1h>255",null," "]
[null,null,null,null,null,null,null,null,null,null,null,null,null,{"$f":"IF(N10<Advance_curve!$C$103,N10+1,\"End\")","v":4},480,250000,490,32340,694.44444444444446,46.569600000000001,{"$f":"IF($Q11<255,Advance_curve!$F$5-T11,\"0\")","v":"0"},"TMR1h>255",null," "]
[null,null,null,null,null,null,null,null,null,null,null,null,null,{"$f":"IF(N11<Advance_curve!$C$103,N11+1,\"End\")","v":5},600,200000,392,25872.000000000004,555.55555555555554,46.569600000000008,{"$f":"IF($Q12<255,Advance_curve!$F$5-T12,\"0\")","v":"0"},"TMR1h>255",null," "]
[null,null,null,null,null,null,null,null,null,null,null,null,null,{"$f":"IF(N12<Advance_curve!$C$103,N12+1,\"End\")","v":6},720,166666.66666666666,326,21516,462.96296296296293,46.474560000000004,{"$f":"IF($Q13<255,Advance_curve!$F$5-T13,\"0\")","v":"0"},"TMR1h>255",null," "]
[null,null,null,null,null,null,null,null,null,null,null,null,null,{"$f":"IF(N13<Advance_curve!$C$103,N13+1,\"End\")","v":7},840,142857.14285714287,280,18480,396.82539682539687,46.569599999999994,{"$f":"IF($Q14<255,Advance_curve!$F$5-T14,\"0\")","v":"0"},"TMR1h>255",null,{"$f":"IF($Q14<255,O14,\" \")","v":" "}]
[null,null,null,null,null,null,null,null,null,null,null,null,null,{"$f":"IF(N14<Advance_curve!$C$103,N14+1,\"End\")","v":8},960,125000,245,16170,347.22222222222223,46.569600000000001,{"$f":"IF($Q15<255,Advance_curve!$F$5-T15,\"0\")","v":3.4303999999999988}," ",null,{"$f":"IF($Q15<255,O15,\" \")","v":960}]
[null,null,null,null,null,null,null,null,null,null,null,null,null,{"$f":"IF(N15<Advance_curve!$C$103,N15+1,\"End\")","v":9},1080,111111.11111111111,217,14322.000000000002,308.64197530864197,46.403280000000009,{"$f":"IF($Q16<255,Advance_curve!$F$5-T16,\"0\")","v":3.5967199999999906}," ",null,1080]
[null,null,null,null,null,null,null,null,null,null,null,"<= avance",null,{"$f":"IF(N16<Advance_curve!$C$103,N16+1,\"End\")","v":10},1200,100000,196,12936.000000000002,277.77777777777777,46.569600000000008,{"$f":"IF($Q17<255,Advance_curve!$F$5-T17,\"0\")","v":3.4303999999999917}," ",null,1200]
[null,null,null,null,null,null,null,null,null,null,null,null,null,{"$f":"IF(N17<Advance_curve!$C$103,N17+1,\"End\")","v":"End"}," ",{"$error":"#VALUE!"}," ",{"$error":"#VALUE!"},{"$error":"#VALUE!"},{"$error":"#VALUE!"},{"$f":"IF($Q18<255,Advance_curve!$F$5-T18,\"0\")","v":"0"},"TMR1h>255",null," "]
[null,null,null,null,null,null,null,null,null,null,null,null,null,{"$f":"IF(N18<Advance_curve!$C$103,N18+1,\"End\")","v":"End"}," ",{"$error":"#VALUE!"}," ",{"$error":"#VALUE!"},{"$error":"#VALUE!"},{"$error":"#VALUE!"},{"$f":"IF($Q19<255,Advance_curve!$F$5-T19,\"0\")","v":"0"},"TMR1h>255",null," "]
[null,null,null,null,null,null,null,null,null,null,null,null,null,{"$f":"IF(N19<Advance_curve!$C$103,N19+1,\"End\")","v":"End"}," ",{"$error":"#VALUE!"}," ",{"$error":"#VALUE!"},{"$error":"#VALUE!"},{"$error":"#VALUE!"},{"$f":"IF($Q20<255,Advance_curve!$F$5-T20,\"0\")","v":"0"},"TMR1h>255",null," "]
[null,null,null,null,null,null,null,null,null,null,null,"TDC",null,{"$f":"IF(N20<Advance_curve!$C$103,N20+1,\"End\")","v":"End"}," ",{"$error":"#VALUE!"}," ",{"$error":"#VALUE!"},{"$error":"#VALUE!"},{"$error":"#VALUE!"},{"$f":"IF($Q21<255,Advance_curve!$F$5-T21,\"0\")","v":"0"},"TMR1h>255",null," "]
[null,null,null,null,null,null,null,null,null,null,null,null,null,{"$f":"IF(N21<Advance_curve!$C$103,N21+1,\"End\")","v":"End"}," ",{"$error":"#VALUE!"}," ",{"$error":"#VALUE!"},{"$error":"#VALUE!"},{"$error":"#VALUE!"},{"$f":"IF($Q22<255,Advance_curve!$F$5-T22,\"0\")","v":"0"},"TMR1h>255",null," "]
[null,null,null,null,null,null,null,null,null,null,null,null,null,{"$f":"IF(N22<Advance_curve!$C$103,N22+1,\"End\")","v":"End"}," ",{"$error":"#VALUE!"}," ",{"$error":"#VALUE!"},{"$error":"#VALUE!"},{"$error":"#VALUE!"},{"$f":"IF($Q23<255,Advance_curve!$F$5-T23,\"0\")","v":"0"},"TMR1h>255",null," "]
[null,null,null,null,null,null,null,null,null,null,null,null,null,{"$f":"IF(N23<Advance_curve!$C$103,N23+1,\"End\")","v":"End"}," ",{"$error":"#VALUE!"}," ",{"$error":"#VALUE!"},{"$error":"#VALUE!"},{"$error":"#VALUE!"},{"$f":"IF($Q24<255,Advance_curve!$F$5-T24,\"0\")","v":"0"},"TMR1h>255",null," "]
[null,null,null,null,null,null,null,null,null,null,null,"<= retard",null,{"$f":"IF(N24<Advance_curve!$C$103,N24+1,\"End\")","v":"End"}," ",{"$error":"#VALUE!"}," ",{"$error":"#VALUE!"},{"$error":"#VALUE!"},{"$error":"#VALUE!"},{"$f":"IF($Q25<255,Advance_curve!$F$5-T25,\"0\")","v":"0"},"TMR1h>255",null," "]
[null,null,null,null,null,null,null,null,null,null,null,null,null,{"$f":"IF(N25<Advance_curve!$C$103,N25+1,\"End\")","v":"End"},{"$f":"IF(N26=\"End\",\" \",(N26*60*$I$6)/(2*$I$5))","v":" "},{"$error":"#VALUE!"},{"$f":"IF(N26=\"End\",\" \",INT(P26/($I$4*255)))","v":" "},{"$error":"#VALUE!"},{"$error":"#VALUE!"},{"$error":"#VALUE!"},{"$f":"IF($Q26<255,Advance_curve!$F$5-T26,\"0\")","v":"0"},"TMR1h>255",null," "]
[null,null,null,null,null,null,null,null,null,null,null,null,null,{"$f":"IF(N26<Advance_curve!$C$103,N26+1,\"End\")","v":"End"},{"$f":"IF(N27=\"End\",\" \",(N27*60*$I$6)/(2*$I$5))","v":" "},{"$f":"IF(N27<>\"End\",(1000000/N27),#N/A)","v":{"$error":"#N/A"}},{"$f":"IF(N27=\"End\",\" \",INT(P27/($I$4*255)))","v":" "},{"$error":"#VALUE!"},{"$error":"#N/A"},{"$error":"#VALUE!"},{"$f":"IF($Q27<255,Advance_curve!$F$5-T27,\"0\")","v":"0"},"TMR1h>255",null," "]
[null,null,null,null,null,null,null,null,null,null,null,null,null,{"$f":"IF(N27<Advance_curve!$C$103,N27+1,\"End\")","v":"End"}," ",{"$f":"IF(N28<>\"End\",(1000000/N28),#N/A)","v":{"$error":"#N/A"}},{"$f":"IF(N28=\"End\",\" \",INT(P28/($I$4*255)))","v":" "},{"$error":"#VALUE!"},{"$error":"#N/A"},{"$error":"#VALUE!"},{"$f":"IF($Q28<255,Advance_curve!$F$5-T28,\"0\")","v":"0"},"TMR1h>255",null," "]
[null,null,null,null,null,null,null,null,null,null,null,null,null,{"$f":"IF(N28<Advance_curve!$C$103,N28+1,\"End\")","v":"End"}," ",{"$error":"#N/A"}," ",{"$error":"#VALUE!"},{"$error":"#N/A"},{"$error":"#VALUE!"},{"$f":"IF($Q29<255,Advance_curve!$F$5-T29,\"0\")","v":"0"},"TMR1h>255",null," "]
[null,null,null,null,null,null,null,null,null,null,null,null,null,{"$f":"IF(N29<Advance_curve!$C$103,N29+1,\"End\")","v":"End"}," ",{"$error":"#N/A"}," ",{"$error":"#VALUE!"},{"$error":"#N/A"},{"$error":"#VALUE!"},{"$f":"IF($Q30<255,Advance_curve!$F$5-T30,\"0\")","v":"0"},"TMR1h>255",null," "]
[null,null,null,null,null,null,null,null,null,null,null,null,null,{"$f":"IF(N30<Advance_curve!$C$103,N30+1,\"End\")","v":"End"}," ",{"$error":"#N/A"}," ",{"$error":"#VALUE!"},{"$error":"#N/A"},{"$error":"#VALUE!"},{"$f":"IF($Q31<255,Advance_curve!$F$5-T31,\"0\")","v":"0"},"TMR1h>255",null," "]
[null,null,null,null,null,null,null,null,null,null,null,null,null,{"$f":"IF(N31<Advance_curve!$C$103,N31+1,\"End\")","v":"End"}," ",{"$error":"#N/A"}," ",{"$error":"#VALUE!"},{"$error":"#N/A"},{"$error":"#VALUE!"},{"$f":"IF($Q32<255,Advance_curve!$F$5-T32,\"0\")","v":"0"},"TMR1h>255",null," "]
[null,null,null,null,null,null,null,null,null,null,null,null,null,{"$f":"IF(N32<Advance_curve!$C$103,N32+1,\"End\")","v":"End"}," ",{"$error":"#N/A"}," ",{"$error":"#VALUE!"},{"$error":"#N/A"},{"$error":"#VALUE!"},{"$f":"IF($Q33<255,Advance_curve!$F$5-T33,\"0\")","v":"0"},"TMR1h>255",null," "]
[null,null,null,null,null,null,null,null,null,null,null,null,null,{"$f":"IF(N33<Advance_curve!$C$103,N33+1,\"End\")","v":"End"}," ",{"$error":"#N/A"}," ",{"$error":"#VALUE!"},{"$error":"#N/A"},{"$error":"#VALUE!"},{"$f":"IF($Q34<255,Advance_curve!$F$5-T34,\"0\")","v":"0"},"TMR1h>255",null," "]
[null,null,null,null,null,null,null,null,null,null,null,null,null,{"$f":"IF(N34<Advance_curve!$C$103,N34+1,\"End\")","v":"End"}," ",{"$error":"#N/A"}," ",{"$error":"#VALUE!"},{"$error":"#N/A"},{"$error":"#VALUE!"},{"$f":"IF($Q35<255,Advance_curve!$F$5-T35,\"0\")","v":"0"},"TMR1h>255",null," "]
[null,null,null,null,null,null,null,null,null,null,null,null,null,{"$f":"IF(N35<Advance_curve!$C$103,N35+1,\"End\")","v":"End"}," ",{"$error":"#N/A"}," ",{"$error":"#VALUE!"},{"$error":"#N/A"},{"$error":"#VALUE!"},{"$f":"IF($Q36<255,Advance_curve!$F$5-T36,\"0\")","v":"0"},"TMR1h>255",null," "]
[null,null,null,null,null,null,null,null,null,null,null,null,null,{"$f":"IF(N36<Advance_curve!$C$103,N36+1,\"End\")","v":"End"}," ",{"$error":"#N/A"}," ",{"$error":"#VALUE!"},{"$error":"#N/A"},{"$error":"#VALUE!"},{"$f":"IF($Q37<255,Advance_curve!$F$5-T37,\"0\")","v":"0"},"TMR1h>255",null," "]
[null,null,null,null,null,null,null,null,null,null,null,null,null,{"$f":"IF(N37<Advance_curve!$C$103,N37+1,\"End\")","v":"End"}," ",{"$error":"#N/A"}," ",{"$error":"#VALUE!"},{"$error":"#N/A"},{"$error":"#VALUE!"},{"$f":"IF($Q38<255,Advance_curve!$F$5-T38,\"0\")","v":"0"},"TMR1h>255",null," "]
[null,null,null,null,null,null,null,null,null,null,null,null,null,{"$f":"IF(N38<Advance_curve!$C$103,N38+1,\"End\")","v":"End"}," ",{"$error":"#N/A"}," ",{"$error":"#VALUE!"},{"$error":"#N/A"},{"$error":"#VALUE!"},{"$f":"IF($Q39<255,Advance_curve!$F$5-T39,\"0\")","v":"0"},"TMR1h>255",null," "]
[null,null,null,null,null,null,null,null,null,null,null,null,null,{"$f":"IF(N39<Advance_curve!$C$103,N39+1,\"End\")","v":"End"}," ",{"$error":"#N/A"}," ",{"$error":"#VALUE!"},{"$error":"#N/A"},{"$error":"#VALUE!"},{"$f":"IF($Q40<255,Advance_curve!$F$5-T40,\"0\")","v":"0"},"TMR1h>255",null," "]
[null,null,null,null,null,null,null,null,null,null,null,null,null,{"$f":"IF(N40<Advance_curve!$C$103,N40+1,\"End\")","v":"End"}," ",{"$error":"#N/A"}," ",{"$error":"#VALUE!"},{"$error":"#N/A"},{"$error":"#VALUE!"},{"$f":"IF($Q41<255,Advance_curve!$F$5-T41,\"0\")","v":"0"},"TMR1h>255",null," "]
[null,null,null,null,null,null,null,null,null,null,null,null,null,{"$f":"IF(N41<Advance_curve!$C$103,N41+1,\"End\")","v":"End"}," ",{"$error":"#N/A"}," ",{"$error":"#VALUE!"},{"$error":"#N/A"},{"$error":"#VALUE!"},{"$f":"IF($Q42<255,Advance_curve!$F$5-T42,\"0\")","v":"0"},"TMR1h>255",null," "]
[null,null,null,null,null,null,null,null,null,null,null,null,null,{"$f":"IF(N42<Advance_curve!$C$103,N42+1,\"End\")","v":"End"}," ",{"$error":"#N/A"}," ",{"$error":"#VALUE!"},{"$error":"#N/A"},{"$error":"#VALUE!"},{"$f":"IF($Q43<255,Advance_curve!$F$5-T43,\"0\")","v":"0"},"TMR1h>255",null," "]
[null,null,null,null,null,null,null,null,null,null,null,null,null,{"$f":"IF(N43<Advance_curve!$C$103,N43+1,\"End\")","v":"End"}," ",{"$error":"#N/A"}," ",{"$error":"#VALUE!"},{"$error":"#N/A"},{"$error":"#VALUE!"},{"$f":"IF($Q44<255,Advance_curve!$F$5-T44,\"0\")","v":"0"},"TMR1h>255",null," "]
[null,null,null,null,null,null,null,null,null,null,null,null,null,{"$f":"IF(N44<Advance_curve!$C$103,N44+1,\"End\")","v":"End"}," ",{"$error":"#N/A"}," ",{"$error":"#VALUE!"},{"$error":"#N/A"},{"$error":"#VALUE!"},{"$f":"IF($Q45<255,Advance_curve!$F$5-T45,\"0\")","v":"0"},"TMR1h>255",null," "]
[null,null,null,null,null,null,null,null,null,null,null,null,null,{"$f":"IF(N45<Advance_curve!$C$103,N45+1,\"End\")","v":"End"}," ",{"$error":"#N/A"}," ",{"$error":"#VALUE!"},{"$error":"#N/A"},{"$error":"#VALUE!"},{"$f":"IF($Q46<255,Advance_curve!$F$5-T46,\"0\")","v":"0"},"TMR1h>255",null," "]
[null,null,null,null,null,null,null,null,null,null,null,null,null,{"$f":"IF(N46<Advance_curve!$C$103,N46+1,\"End\")","v":"End"}," ",{"$error":"#N/A"}," ",{"$error":"#VALUE!"},{"$error":"#N/A"},{"$error":"#VALUE!"},{"$f":"IF($Q47<255,Advance_curve!$F$5-T47,\"0\")","v":"0"},"TMR1h>255",null," "]
[null,null,null,null,null,null,null,null,null,null,null,null,null,{"$f":"IF(N47<Advance_curve!$C$103,N47+1,\"End\")","v":"End"}," ",{"$error":"#N/A"}," ",{"$error":"#VALUE!"},{"$error":"#N/A"},{"$error":"#VALUE!"},{"$f":"IF($Q48<255,Advance_curve!$F$5-T48,\"0\")","v":"0"},"TMR1h>255",null," "]
[null,null,null,null,null,null,null,null,null,null,null,null,null,{"$f":"IF(N48<Advance_curve!$C$103,N48+1,\"End\")","v":"End"}," ",{"$error":"#N/A"}," ",{"$error":"#VALUE!"},{"$error":"#N/A"},{"$error":"#VALUE!"},{"$f":"IF($Q49<255,Advance_curve!$F$5-T49,\"0\")","v":"0"},"TMR1h>255",null," "]

{"sheet":"VeryLowRPM","index":3,"n_rows":9,"n_cols":7,"rows_kept":9,"cut":false,"hidden":false,"merged":[]}
[]
[null,{"$f":"CONCATENATE(\"Advance from \",E9,\" to \",advance_at_lowRPM!X7,\" RPM\")","v":"Advance from 91 to 960 RPM"}]
[null,null,null,null,null,null,"Si une periode entre 2 pkp fait 131ms pour 360°"]
[null,"Prescaler",{"$f":"Advance_curve!M30","v":2},null,null,null,"alors 50° (pkp position) sont parcourus en 131/360*50 = 18ms"]
[null,"clock",4,null,null,null,"Si on attend 18ms x TMR1DEB on spark pile au TDC."]
[null,"periode TMR1L",{"$f":"4*C4/C5","v":2},null,5,"debords max"]
[null,"TMR1",{"$f":"65536*C6/1000","v":131.072},"ms",{"$f":"E6*C7","v":655.36},"ms"]
[null,"pkp position",{"$f":"Advance_curve!F5","v":50},"deg",{"$f":"1000/E7","v":1.52587890625},"Hz"]
[null,"Time from pickup position to TDC",{"$f":"(C7/360)*C8","v":18.204444444444444},"ms",{"$f":"INT(60*E8)","v":91},"rpm"]

{"sheet":"EEPROM8","index":4,"n_rows":130,"n_cols":26,"rows_kept":130,"cut":false,"hidden":false,"merged":[[18,1,18,2]]}
[null,null,null,null,null,null,null,null,null,null,null,null,"INTEL 8HEX format",null,"RAW format",null,null,null,null,null,null,null,null,null,null,"MCH Format"]
["Address\n(hex)","Bytes\n in\nRow","Address\nStart\n(dec)","+0","+1","+2","+3","+4","+5","+6","+7",null,":020000040000FA",null,null,null,"sum[dec]","sum[hex]","LSB","two's\ncomplement [dec]","two's\ncomplement +1","cksum"]
[{"$f":"DEC2HEX(C3,4)","v":"0000"},8,0,{"$f":"Advance_curve!J9","v":27},{"$f":"Advance_curve!J10","v":29},{"$f":"Advance_curve!J11","v":31},{"$f":"Advance_curve!J12","v":33},{"$f":"Advance_curve!J13","v":34},{"$f":"Advance_curve!J14","v":37},{"$f":"Advance_curve!J15","v":39},{"$f":"Advance_curve!J16","v":42},null,{"$f":"\":\"&DEC2HEX(B3,2)&DEC2HEX(C3,4)&\"00\"&DEC2HEX(D3,2)&DEC2HEX(E3,2)&DEC2HEX(F3,2)&DEC2HEX(G3,2)&DEC2HEX(H3,2)&DEC2HEX(I3,2)&DEC2HEX(J3,2)&DEC2HEX(K3,2)&V3","v":":080000001B1D1F212225272AE8"},null,{"$f":"DEC2HEX(D3,2)&\" \"&DEC2HEX(E3,2)&\" \"&DEC2HEX(F3,2)&\" \"&DEC2HEX(G3,2)&\"   \"&DEC2HEX(H3,2)&\" \"&DEC2HEX(I3,2)&\" \"&DEC2HEX(J3,2)&\" \"&DEC2HEX(K3,2)","v":"1B 1D 1F 21   22 25 27 2A"},null,{"$f":"SUM(B3:K3)","v":280},{"$f":"DEC2HEX(Q3)","v":"118"},{"$f":"RIGHT(R3,2)","v":"18"},{"$f":"255-HEX2DEC(S3)","v":231},{"$f":"T3+1","v":232},{"$f":"IF(U3=256,\"00\",DEC2HEX(U3,2))","v":"E8"},null,null,null,{"$f":"DEC2HEX(D3,2)","v":"1B"}]
["0008",8,8,{"$f":"Advance_curve!J17","v":45},{"$f":"Advance_curve!J18","v":47},{"$f":"Advance_curve!J19","v":50},{"$f":"Advance_curve!J20","v":52},{"$f":"Advance_curve!J21","v":55},{"$f":"Advance_curve!J22","v":57},{"$f":"Advance_curve!J23","v":60},{"$f":"Advance_curve!J24","v":63},null,{"$f":"\":\"&DEC2HEX(B4,2)&DEC2HEX(C4,4)&\"00\"&DEC2HEX(D4,2)&DEC2HEX(E4,2)&DEC2HEX(F4,2)&DEC2HEX(G4,2)&DEC2HEX(H4,2)&DEC2HEX(I4,2)&DEC2HEX(J4,2)&DEC2HEX(K4,2)&V4","v":":080008002D2F323437393C3F43"},null,{"$f":"DEC2HEX(D4,2)&\" \"&DEC2HEX(E4,2)&\" \"&DEC2HEX(F4,2)&\" \"&DEC2HEX(G4,2)&\"   \"&DEC2HEX(H4,2)&\" \"&DEC2HEX(I4,2)&\" \"&DEC2HEX(J4,2)&\" \"&DEC2HEX(K4,2)","v":"2D 2F 32 34   37 39 3C 3F"},null,{"$f":"SUM(B4:K4)","v":445},{"$f":"DEC2HEX(Q4)","v":"1BD"},{"$f":"RIGHT(R4,2)","v":"BD"},{"$f":"255-HEX2DEC(S4)","v":66},{"$f":"T4+1","v":67},"43",null,null,null,{"$f":"DEC2HEX(E3,2)","v":"1D"}]
["0010",8,16,{"$f":"Advance_curve!J25","v":65},{"$f":"Advance_curve!J26","v":68},{"$f":"Advance_curve!J27","v":70},{"$f":"Advance_curve!J28","v":73},{"$f":"Advance_curve!J29","v":75},{"$f":"Advance_curve!J30","v":78},{"$f":"Advance_curve!J31","v":80},{"$f":"Advance_curve!J32","v":83},null,{"$f":"\":\"&DEC2HEX(B5,2)&DEC2HEX(C5,4)&\"00\"&DEC2HEX(D5,2)&DEC2HEX(E5,2)&DEC2HEX(F5,2)&DEC2HEX(G5,2)&DEC2HEX(H5,2)&DEC2HEX(I5,2)&DEC2HEX(J5,2)&DEC2HEX(K5,2)&V5","v":":08001000414446494B4E505398"},null,"41 44 46 49   4B 4E 50 53",null,616,"268","68",151,152,"98",null,null,null,{"$f":"DEC2HEX(F3,2)","v":"1F"}]
["0018",8,24,{"$f":"Advance_curve!J33","v":86},{"$f":"Advance_curve!J34","v":88},{"$f":"Advance_curve!J35","v":91},{"$f":"Advance_curve!J36","v":93},{"$f":"Advance_curve!J37","v":96},{"$f":"Advance_curve!J38","v":98},{"$f":"Advance_curve!J39","v":101},{"$f":"Advance_curve!J40","v":103},null,":0800180056585B5D60626567EC",null,"56 58 5B 5D   60 62 65 67",null,788,"314","14",235,236,"EC",null,null,null,{"$f":"DEC2HEX(G3,2)","v":"21"}]
["0020",8,32,{"$f":"Advance_curve!J41","v":106},{"$f":"Advance_curve!J42","v":109},{"$f":"Advance_curve!J43","v":111},{"$f":"Advance_curve!J44","v":114},{"$f":"Advance_curve!J45","v":116},{"$f":"Advance_curve!J46","v":119},{"$f":"Advance_curve!J47","v":121},{"$f":"Advance_curve!J48","v":124},null,":080020006A6D6F727477797C40",null,"6A 6D 6F 72   74 77 79 7C",null,960,"3C0","C0",63,64,"40",null,null,null,{"$f":"DEC2HEX(H3,2)","v":"22"}]
["0028",8,40,{"$f":"Advance_curve!J49","v":127},{"$f":"Advance_curve!J50","v":129},{"$f":"Advance_curve!J51","v":132},{"$f":"Advance_curve!J52","v":134},{"$f":"Advance_curve!J53","v":137},{"$f":"Advance_curve!J54","v":139},{"$f":"Advance_curve!J55","v":142},{"$f":"Advance_curve!J56","v":144},null,":080028007F818486898B8E9094",null,"7F 81 84 86   89 8B 8E 90",null,1132,"46C","6C",147,148,"94",null,null,null,{"$f":"DEC2HEX(I3,2)","v":"25"}]
["0030",8,48,{"$f":"Advance_curve!J57","v":147},{"$f":"Advance_curve!J58","v":150},{"$f":"Advance_curve!J59","v":152},{"$f":"Advance_curve!J60","v":155},{"$f":"Advance_curve!J61","v":157},{"$f":"Advance_curve!J62","v":160},{"$f":"Advance_curve!J63","v":162},{"$f":"Advance_curve!J64","v":165},null,":080030009396989B9DA0A2A5E8",null,"93 96 98 9B   9D A0 A2 A5",null,1304,"518","18",231,232,"E8",null,null,null,{"$f":"DEC2HEX(J3,2)","v":"27"}]
["0038",8,56,{"$f":"Advance_curve!J65","v":167},{"$f":"Advance_curve!J66","v":170},{"$f":"Advance_curve!J67","v":173},{"$f":"Advance_curve!J68","v":175},{"$f":"Advance_curve!J69","v":178},{"$f":"Advance_curve!J70","v":180},{"$f":"Advance_curve!J71","v":183},{"$f":"Advance_curve!J72","v":185},null,":08003800A7AAADAFB2B4B7B93D",null,"A7 AA AD AF   B2 B4 B7 B9",null,1475,"5C3","C3",60,61,"3D",null,null,null,{"$f":"DEC2HEX(K3,2)","v":"2A"}]
["0040",8,64,{"$f":"Advance_curve!J73","v":188},{"$f":"Advance_curve!J74","v":191},{"$f":"Advance_curve!J75","v":193},{"$f":"Advance_curve!J76","v":196},{"$f":"Advance_curve!J77","v":198},{"$f":"Advance_curve!J78","v":201},{"$f":"Advance_curve!J79","v":203},{"$f":"Advance_curve!J80","v":206},null,":08004000BCBFC1C4C6C9CBCE90",null,"BC BF C1 C4   C6 C9 CB CE",null,1648,"670","70",143,144,"90",null,null,null,{"$f":"DEC2HEX(D4,2)","v":"2D"}]
["0048",8,72,{"$f":"Advance_curve!J81","v":209},{"$f":"Advance_curve!J82","v":211},{"$f":"Advance_curve!J83","v":214},{"$f":"Advance_curve!J84","v":216},{"$f":"Advance_curve!J85","v":219},{"$f":"Advance_curve!J86","v":221},{"$f":"Advance_curve!J87","v":224},{"$f":"Advance_curve!J88","v":226},null,":08004800D1D3D6D8DBDDE0E2E4",null,"D1 D3 D6 D8   DB DD E0 E2",null,1820,"71C","1C",227,228,{"$f":"IF(U12=256,\"00\",DEC2HEX(U12,2))","v":"E4"},null,null,null,{"$f":"DEC2HEX(E4,2)","v":"2F"}]
[{"$f":"DEC2HEX(C13,4)","v":"0050"},8,80,{"$f":"Advance_curve!J89","v":229},{"$f":"Advance_curve!J90","v":232},{"$f":"Advance_curve!J91","v":234},{"$f":"Advance_curve!J92","v":237},{"$f":"Advance_curve!J93","v":239},{"$f":"Advance_curve!J94","v":242},{"$f":"Advance_curve!J95","v":244},{"$f":"Advance_curve!J96","v":247},null,":08005000E5E8EAEDEFF2F4F738",null,"E5 E8 EA ED   EF F2 F4 F7",null,1992,"7C8","C8",55,56,{"$f":"IF(U13=256,\"00\",DEC2HEX(U13,2))","v":"38"},null,null,null,{"$f":"DEC2HEX(F4,2)","v":"32"}]
["0058",8,88,{"$f":"Advance_curve!J97","v":250},{"$f":"Advance_curve!J98","v":252},{"$f":"Advance_curve!J99","v":255},{"$f":"Advance_curve!J100","v":255},{"$f":"Advance_curve!J101","v":255},{"$f":"Advance_curve!J102","v":255},{"$f":"Advance_curve!J103","v":255},0,null,":08005800FAFCFFFFFFFFFF00AF",null,"FA FC FF FF   FF FF FF 00",null,1873,"751","51",174,175,"AF",null,null,null,{"$f":"DEC2HEX(G4,2)","v":"34"}]
[{"$f":"DEC2HEX(C15,4)","v":"0060"},8,96,0,0,0,0,0,0,0,0,null,":08006000000000000000000098",null,"00 00 00 00   00 00 00 00",null,104,"68","68",151,152,"98",null,null,null,{"$f":"DEC2HEX(H4,2)","v":"37"}]
["0068",8,104,0,0,0,0,0,0,0,0,null,":08006800000000000000000090",null,"00 00 00 00   00 00 00 00",null,{"$f":"SUM(B16:K16)","v":112},"70","70",143,144,"90",null,null,null,{"$f":"DEC2HEX(I4,2)","v":"39"}]
["0070",8,112,{"$f":"Advance_curve!I1","v":79},{"$f":"Advance_curve!J1","v":20},{"$f":"Advance_curve!K1","v":2},{"$f":"Advance_curve!F5","v":50},20,20,20,{"$f":"Advance_curve!$M$35","v":1},null,{"$f":"\":\"&DEC2HEX(B17,2)&DEC2HEX(C17,4)&\"00\"&DEC2HEX(D17,2)&DEC2HEX(E17,2)&DEC2HEX(F17,2)&DEC2HEX(G17,2)&DEC2HEX(H17,2)&DEC2HEX(I17,2)&DEC2HEX(J17,2)&DEC2HEX(K17,2)&V17","v":":080070004F14023214141401B4"},null,{"$f":"DEC2HEX(D17,2)&\" \"&DEC2HEX(E17,2)&\" \"&DEC2HEX(F17,2)&\" \"&DEC2HEX(G17,2)&\"   \"&DEC2HEX(H17,2)&\" \"&DEC2HEX(I17,2)&\" \"&DEC2HEX(J17,2)&\" \"&DEC2HEX(K17,2)","v":"4F 14 02 32   14 14 14 01"},null,332,"14C","4C",179,180,"B4",null,null,null,{"$f":"DEC2HEX(J4,2)","v":"3C"}]
["0078",8,120,{"$f":"VeryLowRPM!C9","v":18.204444444444444},{"$f":"INT((1/Advance_curve!$M$30)*(60*1000000)/Advance_curve!$M$34)/256","v":12},{"$f":"IF(Advance_curve!M32=\"Auto\",99,Advance_curve!M32/ 500)","v":99},{"$f":"Advance_curve!M30","v":2},{"$f":"advance_at_lowRPM!I2","v":15},{"$f":"Advance_curve!J5","v":20},{"$f":"Advance_curve!$B$9","v":11},{"$f":"Advance_curve!$B$103","v":105},null,{"$f":"\":\"&DEC2HEX(B18,2)&DEC2HEX(C18,4)&\"00\"&DEC2HEX(D18,2)&DEC2HEX(E18,2)&DEC2HEX(F18,2)&DEC2HEX(G18,2)&DEC2HEX(H18,2)&DEC2HEX(I18,2)&DEC2HEX(J18,2)&DEC2HEX(K18,2)&V18","v":":08007800120C63020F140B6966"},null,{"$f":"DEC2HEX(D18,2)&\" \"&DEC2HEX(E18,2)&\" \"&DEC2HEX(F18,2)&\" \"&DEC2HEX(G18,2)&\"   \"&DEC2HEX(H18,2)&\" \"&DEC2HEX(I18,2)&\" \"&DEC2HEX(J18,2)&\" \"&DEC2HEX(K18,2)","v":"12 0C 63 02   0F 14 0B 69"},null,410.20444444444445,"19A","9A",101,102,"66",null,null,null,{"$f":"DEC2HEX(K4,2)","v":"3F"}]
[null,null,null,"End of File",null,null,null,null,null,null,null,null,":00000001FF",null,null,null,null,null,null,null,null,null,null,null,null,{"$f":"DEC2HEX(D5,2)","v":"41"}]
[null,null,null,null,null,null,null,null,null,null,null,null,null,null,null,null,null,null,null,null,null,null,null,null,null,{"$f":"DEC2HEX(E5,2)","v":"44"}]
[null,null,null,null,null,null,null,null,null,null,null,null,"The checksum value is the two's complement of the least significant byte (LSB) of the sum of all decoded byte values in the record that precede the checksum. ",null,null,null,null,null,null,null,null,null,null,null,null,{"$f":"DEC2HEX(F5,2)","v":"46"}]
[null,null,null,null,null,null,null,null,null,null,null,null,"It is computed by summing the decoded byte values, extracting the LSB of the sum, and calculating the two's complement of the LSB",null,null,null,null,null,null,null,null,null,null,null,null,{"$f":"DEC2HEX(G5,2)","v":"49"}]
[null,null,null,null,null,null,null,null,null,null,null,null,"(e.g., by inverting its bits and adding one).",null,null,null,null,null,null,null,null,null,null,null,null,{"$f":"DEC2HEX(H5,2)","v":"4B"}]
[null,null,null,null,null,null,null,null,null,null,null,null,"For example, in the case of the record :0300300002337A1E, the sum of the decoded byte values is 03 + 00 + 30 + 00 + 02 + 33 + 7A = E2.",null,null,null,null,null,null,null,null,null,null,null,null,{"$f":"DEC2HEX(I5,2)","v":"4E"}]
[null,null,null,null,null,null,null,null,null,null,null,null,"The two's complement of E2 is 1E, which is the checksum appearing at the end of the record.",null,null,null,null,null,null,null,null,null,null,null,null,{"$f":"DEC2HEX(J5,2)","v":"50"}]
[null,null,null,null,null,null,null,null,null,null,null,null,null,null,null,null,null,null,null,null,null,null,null,null,null,{"$f":"DEC2HEX(K5,2)","v":"53"}]
[null,null,null,null,null,null,null,null,null,null,null,null,"Pour effectuer un complément à 2 il faut :",null,null,null,null,null,null,null,null,null,null,null,null,{"$f":"DEC2HEX(D6,2)","v":"56"}]
[null,null,null,null,null,null,null,null,null,null,null,null,"- Inverser tout les bits (1 en 0, 0 en 1) (ou faire 255-chiffre) Ex: DECHEX(255-SOMME(B3:K3)+1) = DECHEX(255+1-SOMME(B3:K3)) = DECHEX(256-SOMME(B3:K3))",null,null,null,null,null,null,null,null,null,null,null,null,{"$f":"DEC2HEX(E6,2)","v":"58"}]
[null,null,null,null,null,null,null,null,null,null,null,null," puis ajouter 1 au résultat",null,null,null,null,null,null,null,null,null,null,null,null,{"$f":"DEC2HEX(F6,2)","v":"5B"}]
[null,null,null,null,null,null,null,null,null,null,null,null,"le complement a 2 de 0 est egal a 0",null,null,null,null,null,null,null,null,null,null,null,null,{"$f":"DEC2HEX(G6,2)","v":"5D"}]
[null,null,null,null,null,null,null,null,null,null,null,null,"Si 2 derniers chiffres de h100 = 00: cksum OK",null,null,null,null,null,null,null,null,null,null,null,null,{"$f":"DEC2HEX(H6,2)","v":"60"}]
[null,null,null,null,null,null,null,null,null,null,null,null,null,null,null,null,null,null,null,null,null,null,null,null,null,{"$f":"DEC2HEX(I6,2)","v":"62"}]
[null,null,null,null,null,null,null,null,null,null,null,null,null,null,null,null,null,null,null,null,null,null,null,null,null,{"$f":"DEC2HEX(J6,2)","v":"65"}]
[null,null,null,null,null,null,null,null,null,null,null,null,"Méthode 1 (1er onglet)",null,null,null,null,null,null,null,null,null,null,null,null,{"$f":"DEC2HEX(K6,2)","v":"67"}]
[null,null,null,null,null,null,null,null,null,null,null,null,"C'est la méthode bestiale. On convertit le nombre (positif) en base 2, puis on inverse les bits et ensuite on ajoute 1 avec propagation d'une éventuelle retenue.",null,null,null,null,null,null,null,null,null,null,null,null,{"$f":"DEC2HEX(D7,2)","v":"6A"}]
[null,null,null,null,null,null,null,null,null,null,null,null,null,null,null,null,null,null,null,null,null,null,null,null,null,{"$f":"DEC2HEX(E7,2)","v":"6D"}]
[null,null,null,null,null,null,null,null,null,null,null,null,"Méthode 2 (2ème onglet)",null,null,null,null,null,null,null,null,null,null,null,null,{"$f":"DEC2HEX(F7,2)","v":"6F"}]
[null,null,null,null,null,null,null,null,null,null,null,null,"On utilise la formule suivante pour le complément à 2: Si X est le nombre négatif à convertir, la conversion de (2^16)-|X| en base 2 donne le résultat.",null,null,null,null,null,null,null,null,null,null,null,null,{"$f":"DEC2HEX(G7,2)","v":"72"}]
[null,null,null,null,null,null,null,null,null,null,null,null,null,null,null,null,null,null,null,null,null,null,null,null,null,{"$f":"DEC2HEX(H7,2)","v":"74"}]
[null,null,null,null,null,null,null,null,null,null,null,null,null,null,null,null,null,null,null,null,null,null,null,null,null,{"$f":"DEC2HEX(I7,2)","v":"77"}]
[null,null,null,null,null,null,null,null,null,null,null,null,null,null,null,null,null,null,null,null,null,null,null,null,null,{"$f":"DEC2HEX(J7,2)","v":"79"}]
[null,null,null,null,null,null,null,null,null,null,null,null,null,null,null,null,null,null,null,null,null,null,null,null,null,{"$f":"DEC2HEX(K7,2)","v":"7C"}]
[null,null,null,null,null,null,null,null,null,null,null,null,null,null,null,null,null,null,null,null,null,null,null,null,null,{"$f":"DEC2HEX(D8,2)","v":"7F"}]
[null,null,null,null,null,null,null,null,null,null,null,null,null,null,null,null,null,null,null,null,null,null,null,null,null,{"$f":"DEC2HEX(E8,2)","v":"81"}]
[null,null,null,null,null,null,null,null,null,null,null,null,null,null,null,null,null,null,null,null,null,null,null,null,null,{"$f":"DEC2HEX(F8,2)","v":"84"}]
[null,null,null,null,null,null,null,null,null,null,null,null,null,null,null,null,null,null,null,null,null,null,null,null,null,{"$f":"DEC2HEX(G8,2)","v":"86"}]
[null,null,null,null,null,null,null,null,null,null,null,null,null,null,null,null,null,null,null,null,null,null,null,null,null,{"$f":"DEC2HEX(H8,2)","v":"89"}]
[null,null,null,null,null,null,null,null,null,null,null,null,null,null,null,null,null,null,null,null,null,null,null,null,null,{"$f":"DEC2HEX(I8,2)","v":"8B"}]
[null,null,null,null,null,null,null,null,null,null,null,null,null,null,null,null,null,null,null,null,null,null,null,null,null,{"$f":"DEC2HEX(J8,2)","v":"8E"}]
[null,null,null,null,null,null,null,null,null,null,null,null,null,null,null,null,null,null,null,null,null,null,null,null,null,{"$f":"DEC2HEX(K8,2)","v":"90"}]
[null,null,null,null,null,null,null,null,null,null,null,null,null,null,null,null,null,null,null,null,null,null,null,null,null,{"$f":"DEC2HEX(D9,2)","v":"93"}]
[null,null,null,null,null,null,null,null,null,null,null,null,null,null,null,null,null,null,null,null,null,null,null,null,null,{"$f":"DEC2HEX(E9,2)","v":"96"}]
[null,null,null,null,null,null,null,null,null,null,null,null,null,null,null,null,null,null,null,null,null,null,null,null,null,{"$f":"DEC2HEX(F9,2)","v":"98"}]
[null,null,null,null,null,null,null,null,null,null,null,null,null,null,null,null,null,null,null,null,null,null,null,null,null,{"$f":"DEC2HEX(G9,2)","v":"9B"}]
[null,null,null,null,null,null,null,null,null,null,null,null,null,null,null,null,null,null,null,null,null,null,null,null,null,{"$f":"DEC2HEX(H9,2)","v":"9D"}]
[null,null,null,null,null,null,null,null,null,null,null,null,null,null,null,null,null,null,null,null,null,null,null,null,null,{"$f":"DEC2HEX(I9,2)","v":"A0"}]
[null,null,null,null,null,null,null,null,null,null,null,null,null,null,null,null,null,null,null,null,null,null,null,null,null,{"$f":"DEC2HEX(J9,2)","v":"A2"}]
[null,null,null,null,null,null,null,null,null,null,null,null,null,null,null,null,null,null,null,null,null,null,null,null,null,{"$f":"DEC2HEX(K9,2)","v":"A5"}]
[null,null,null,null,null,null,null,null,null,null,null,null,null,null,null,null,null,null,null,null,null,null,null,null,null,{"$f":"DEC2HEX(D10,2)","v":"A7"}]
[null,null,null,null,null,null,null,null,null,null,null,null,null,null,null,null,null,null,null,null,null,null,null,null,null,{"$f":"DEC2HEX(E10,2)","v":"AA"}]
[null,null,null,null,null,null,null,null,null,null,null,null,null,null,null,null,null,null,null,null,null,null,null,null,null,{"$f":"DEC2HEX(F10,2)","v":"AD"}]
[null,null,null,null,null,null,null,null,null,null,null,null,null,null,null,null,null,null,null,null,null,null,null,null,null,{"$f":"DEC2HEX(G10,2)","v":"AF"}]
[null,null,null,null,null,null,null,null,null,null,null,null,null,null,null,null,null,null,null,null,null,null,null,null,null,{"$f":"DEC2HEX(H10,2)","v":"B2"}]
[null,null,null,null,null,null,null,null,null,null,null,null,null,null,null,null,null,null,null,null,null,null,null,null,null,{"$f":"DEC2HEX(I10,2)","v":"B4"}]
[null,null,null,null,null,null,null,null,null,null,null,null,null,null,null,null,null,null,null,null,null,null,null,null,null,{"$f":"DEC2HEX(J10,2)","v":"B7"}]
[null,null,null,null,null,null,null,null,null,null,null,null,null,null,null,null,null,null,null,null,null,null,null,null,null,{"$f":"DEC2HEX(K10,2)","v":"B9"}]
[null,null,null,null,null,null,null,null,null,null,null,null,null,null,null,null,null,null,null,null,null,null,null,null,null,{"$f":"DEC2HEX(D11,2)","v":"BC"}]
[null,null,null,null,null,null,null,null,null,null,null,null,null,null,null,null,null,null,null,null,null,null,null,null,null,{"$f":"DEC2HEX(E11,2)","v":"BF"}]
[null,null,null,null,null,null,null,null,null,null,null,null,null,null,null,null,null,null,null,null,null,null,null,null,null,{"$f":"DEC2HEX(F11,2)","v":"C1"}]
[null,null,null,null,null,null,null,null,null,null,null,null,null,null,null,null,null,null,null,null,null,null,null,null,null,{"$f":"DEC2HEX(G11,2)","v":"C4"}]
[null,null,null,null,null,null,null,null,null,null,null,null,null,null,null,null,null,null,null,null,null,null,null,null,null,{"$f":"DEC2HEX(H11,2)","v":"C6"}]
[null,null,null,null,null,null,null,null,null,null,null,null,null,null,null,null,null,null,null,null,null,null,null,null,null,{"$f":"DEC2HEX(I11,2)","v":"C9"}]
[null,null,null,null,null,null,null,null,null,null,null,null,null,null,null,null,null,null,null,null,null,null,null,null,null,{"$f":"DEC2HEX(J11,2)","v":"CB"}]
[null,null,null,null,null,null,null,null,null,null,null,null,null,null,null,null,null,null,null,null,null,null,null,null,null,{"$f":"DEC2HEX(K11,2)","v":"CE"}]
[null,null,null,null,null,null,null,null,null,null,null,null,null,null,null,null,null,null,null,null,null,null,null,null,null,{"$f":"DEC2HEX(D12,2)","v":"D1"}]
[null,null,null,null,null,null,null,null,null,null,null,null,null,null,null,null,null,null,null,null,null,null,null,null,null,{"$f":"DEC2HEX(E12,2)","v":"D3"}]
[null,null,null,null,null,null,null,null,null,null,null,null,null,null,null,null,null,null,null,null,null,null,null,null,null,{"$f":"DEC2HEX(F12,2)","v":"D6"}]
[null,null,null,null,null,null,null,null,null,null,null,null,null,null,null,null,null,null,null,null,null,null,null,null,null,{"$f":"DEC2HEX(G12,2)","v":"D8"}]
[null,null,null,null,null,null,null,null,null,null,null,null,null,null,null,null,null,null,null,null,null,null,null,null,null,{"$f":"DEC2HEX(H12,2)","v":"DB"}]
[null,null,null,null,null,null,null,null,null,null,null,null,null,null,null,null,null,null,null,null,null,null,null,null,null,{"$f":"DEC2HEX(I12,2)","v":"DD"}]
[null,null,null,null,null,null,null,null,null,null,null,null,null,null,null,null,null,null,null,null,null,null,null,null,null,{"$f":"DEC2HEX(J12,2)","v":"E0"}]
[null,null,null,null,null,null,null,null,null,null,null,null,null,null,null,null,null,null,null,null,null,null,null,null,null,{"$f":"DEC2HEX(K12,2)","v":"E2"}]
[null,null,null,null,null,null,null,null,null,null,null,null,null,null,null,null,null,null,null,null,null,null,null,null,null,{"$f":"DEC2HEX(D13,2)","v":"E5"}]
[null,null,null,null,null,null,null,null,null,null,null,null,null,null,null,null,null,null,null,null,null,null,null,null,null,{"$f":"DEC2HEX(E13,2)","v":"E8"}]
[null,null,null,null,null,null,null,null,null,null,null,null,null,null,null,null,null,null,null,null,null,null,null,null,null,{"$f":"DEC2HEX(F13,2)","v":"EA"}]
[null,null,null,null,null,null,null,null,null,null,null,null,null,null,null,null,null,null,null,null,null,null,null,null,null,{"$f":"DEC2HEX(G13,2)","v":"ED"}]
[null,null,null,null,null,null,null,null,null,null,null,null,null,null,null,null,null,null,null,null,null,null,null,null,null,{"$f":"DEC2HEX(H13,2)","v":"EF"}]
[null,null,null,null,null,null,null,null,null,null,null,null,null,null,null,null,null,null,null,null,null,null,null,null,null,{"$f":"DEC2HEX(I13,2)","v":"F2"}]
[null,null,null,null,null,null,null,null,null,null,null,null,null,null,null,null,null,null,null,null,null,null,null,null,null,{"$f":"DEC2HEX(J13,2)","v":"F4"}]
[null,null,null,null,null,null,null,null,null,null,null,null,null,null,null,null,null,null,null,null,null,null,null,null,null,{"$f":"DEC2HEX(K13,2)","v":"F7"}]
[null,null,null,null,null,null,null,null,null,null,null,null,null,null,null,null,null,null,null,null,null,null,null,null,null,{"$f":"DEC2HEX(D14,2)","v":"FA"}]
[null,null,null,null,null,null,null,null,null,null,null,null,null,null,null,null,null,null,null,null,null,null,null,null,null,{"$f":"DEC2HEX(E14,2)","v":"FC"}]
[null,null,null,null,null,null,null,null,null,null,null,null,null,null,null,null,null,null,null,null,null,null,null,null,null,{"$f":"DEC2HEX(F14,2)","v":"FF"}]
[null,null,null,null,null,null,null,null,null,null,null,null,null,null,null,null,null,null,null,null,null,null,null,null,null,{"$f":"DEC2HEX(G14,2)","v":"FF"}]
[null,null,null,null,null,null,null,null,null,null,null,null,null,null,null,null,null,null,null,null,null,null,null,null,null,{"$f":"DEC2HEX(H14,2)","v":"FF"}]
[null,null,null,null,null,null,null,null,null,null,null,null,null,null,null,null,null,null,null,null,null,null,null,null,null,{"$f":"DEC2HEX(I14,2)","v":"FF"}]
[null,null,null,null,null,null,null,null,null,null,null,null,null,null,null,null,null,null,null,null,null,null,null,null,null,{"$f":"DEC2HEX(J14,2)","v":"FF"}]
[null,null,null,null,null,null,null,null,null,null,null,null,null,null,null,null,null,null,null,null,null,null,null,null,null,{"$f":"DEC2HEX(K14,2)","v":"00"}]
[null,null,null,null,null,null,null,null,null,null,null,null,null,null,null,null,null,null,null,null,null,null,null,null,null,{"$f":"DEC2HEX(D15,2)","v":"00"}]
[null,null,null,null,null,null,null,null,null,null,null,null,null,null,null,null,null,null,null,null,null,null,null,null,null,{"$f":"DEC2HEX(E15,2)","v":"00"}]
[null,null,null,null,null,null,null,null,null,null,null,null,null,null,null,null,null,null,null,null,null,null,null,null,null,{"$f":"DEC2HEX(F15,2)","v":"00"}]
[null,null,null,null,null,null,null,null,null,null,null,null,null,null,null,null,null,null,null,null,null,null,null,null,null,{"$f":"DEC2HEX(G15,2)","v":"00"}]
[null,null,null,null,null,null,null,null,null,null,null,null,null,null,null,null,null,null,null,null,null,null,null,null,null,{"$f":"DEC2HEX(H15,2)","v":"00"}]
[null,null,null,null,null,null,null,null,null,null,null,null,null,null,null,null,null,null,null,null,null,null,null,null,null,{"$f":"DEC2HEX(I15,2)","v":"00"}]
[null,null,null,null,null,null,null,null,null,null,null,null,null,null,null,null,null,null,null,null,null,null,null,null,null,{"$f":"DEC2HEX(J15,2)","v":"00"}]
[null,null,null,null,null,null,null,null,null,null,null,null,null,null,null,null,null,null,null,null,null,null,null,null,null,{"$f":"DEC2HEX(K15,2)","v":"00"}]
[null,null,null,null,null,null,null,null,null,null,null,null,null,null,null,null,null,null,null,null,null,null,null,null,null,{"$f":"DEC2HEX(D16,2)","v":"00"}]
[null,null,null,null,null,null,null,null,null,null,null,null,null,null,null,null,null,null,null,null,null,null,null,null,null,{"$f":"DEC2HEX(E16,2)","v":"00"}]
[null,null,null,null,null,null,null,null,null,null,null,null,null,null,null,null,null,null,null,null,null,null,null,null,null,{"$f":"DEC2HEX(F16,2)","v":"00"}]
[null,null,null,null,null,null,null,null,null,null,null,null,null,null,null,null,null,null,null,null,null,null,null,null,null,{"$f":"DEC2HEX(G16,2)","v":"00"}]
[null,null,null,null,null,null,null,null,null,null,null,null,null,null,null,null,null,null,null,null,null,null,null,null,null,{"$f":"DEC2HEX(H16,2)","v":"00"}]
[null,null,null,null,null,null,null,null,null,null,null,null,null,null,null,null,null,null,null,null,null,null,null,null,null,{"$f":"DEC2HEX(I16,2)","v":"00"}]
[null,null,null,null,null,null,null,null,null,null,null,null,null,null,null,null,null,null,null,null,null,null,null,null,null,{"$f":"DEC2HEX(J16,2)","v":"00"}]
[null,null,null,null,null,null,null,null,null,null,null,null,null,null,null,null,null,null,null,null,null,null,null,null,null,{"$f":"DEC2HEX(K16,2)","v":"00"}]
[null,null,null,null,null,null,null,null,null,null,null,null,null,null,null,null,null,null,null,null,null,null,null,null,null,{"$f":"DEC2HEX(D17,2)","v":"4F"}]
[null,null,null,null,null,null,null,null,null,null,null,null,null,null,null,null,null,null,null,null,null,null,null,null,null,{"$f":"DEC2HEX(E17,2)","v":"14"}]
[null,null,null,null,null,null,null,null,null,null,null,null,null,null,null,null,null,null,null,null,null,null,null,null,null,{"$f":"DEC2HEX(F17,2)","v":"02"}]
[null,null,null,null,null,null,null,null,null,null,null,null,null,null,null,null,null,null,null,null,null,null,null,null,null,{"$f":"DEC2HEX(G17,2)","v":"32"}]
[null,null,null,null,null,null,null,null,null,null,null,null,null,null,null,null,null,null,null,null,null,null,null,null,null,{"$f":"DEC2HEX(H17,2)","v":"14"}]
[null,null,null,null,null,null,null,null,null,null,null,null,null,null,null,null,null,null,null,null,null,null,null,null,null,{"$f":"DEC2HEX(I17,2)","v":"14"}]
[null,null,null,null,null,null,null,null,null,null,null,null,null,null,null,null,null,null,null,null,null,null,null,null,null,{"$f":"DEC2HEX(J17,2)","v":"14"}]
[null,null,null,null,null,null,null,null,null,null,null,null,null,null,null,null,null,null,null,null,null,null,null,null,null,{"$f":"DEC2HEX(K17,2)","v":"01"}]
[null,null,null,null,null,null,null,null,null,null,null,null,null,null,null,null,null,null,null,null,null,null,null,null,null,{"$f":"DEC2HEX(D18,2)","v":"12"}]
[null,null,null,null,null,null,null,null,null,null,null,null,null,null,null,null,null,null,null,null,null,null,null,null,null,{"$f":"DEC2HEX(E18,2)","v":"0C"}]
[null,null,null,null,null,null,null,null,null,null,null,null,null,null,null,null,null,null,null,null,null,null,null,null,null,{"$f":"DEC2HEX(F18,2)","v":"63"}]
[null,null,null,null,null,null,null,null,null,null,null,null,null,null,null,null,null,null,null,null,null,null,null,null,null,{"$f":"DEC2HEX(G18,2)","v":"02"}]
[null,null,null,null,null,null,null,null,null,null,null,null,null,null,null,null,null,null,null,null,null,null,null,null,null,{"$f":"DEC2HEX(H18,2)","v":"0F"}]
[null,null,null,null,null,null,null,null,null,null,null,null,null,null,null,null,null,null,null,null,null,null,null,null,null,{"$f":"DEC2HEX(I18,2)","v":"14"}]
[null,null,null,null,null,null,null,null,null,null,null,null,null,null,null,null,null,null,null,null,null,null,null,null,null,{"$f":"DEC2HEX(J18,2)","v":"0B"}]
[null,null,null,null,null,null,null,null,null,null,null,null,null,null,null,null,null,null,null,null,null,null,null,null,null,{"$f":"DEC2HEX(K18,2)","v":"69"}]

{"sheet":"EEPROM16","index":5,"n_rows":50,"n_cols":25,"rows_kept":50,"cut":false,"hidden":false,"merged":[]}
[null,null,null,null,null,null,null,null,null,null,null,null,null,null,"INTEL 16HEX format",null,"RAW format"]
[]
["Bytes\n in\nRow","Address\nMSB (hex)","Address\nLSB (hex)","Address Start (MSB)","Address\nStart\n(LSB)","+0","+1","+2","+3","+4","+5","+6","+7",null,":020000040000FA",null,null,null,"sum[dec]","sum[hex]","LSB","two's\ncomplement [dec]","two's\ncomplement +1","cksum","cksum corrigé"]
[16,42,{"$f":"DEC2HEX(E4,2)","v":"00"},224,0,{"$f":"Advance_curve!J9","v":27},{"$f":"Advance_curve!J10","v":29},{"$f":"Advance_curve!J11","v":31},{"$f":"Advance_curve!J12","v":33},{"$f":"Advance_curve!J13","v":34},{"$f":"Advance_curve!J14","v":37},{"$f":"Advance_curve!J15","v":39},{"$f":"Advance_curve!J16","v":42},null,{"$f":"\":\"&DEC2HEX(A4,2)&B4&C4&\"00\"&DEC2HEX(F4,2)&\"00\"&DEC2HEX(G4,2)&\"00\"&DEC2HEX(H4,2)&\"00\"&DEC2HEX(I4,2)&\"00\"&DEC2HEX(J4,2)&\"00\"&DEC2HEX(K4,2)&\"00\"&DEC2HEX(L4,2)&\"00\"&DEC2HEX(M4,2)&\"00\"&Y4","v":":104200001B001D001F0021002200250027002A0000"},null,{"$f":"DEC2HEX(F4,2)&\" \"&DEC2HEX(G4,2)&\" \"&DEC2HEX(H4,2)&\" \"&DEC2HEX(I4,2)&\"   \"&DEC2HEX(J4,2)&\" \"&DEC2HEX(K4,2)&\" \"&DEC2HEX(L4,2)&\" \"&DEC2HEX(M4,2)","v":"1B 1D 1F 21   22 25 27 2A"},null,{"$f":"SUM(D4:M4)","v":496},{"$f":"DEC2HEX(S4)","v":"1F0"},{"$f":"RIGHT(T4,2)","v":"F0"},{"$f":"255-HEX2DEC(U4)","v":15},{"$f":"V4+1","v":16},{"$f":"IF(W4=256,\"00\",DEC2HEX(W4,2))","v":"10"},{"$f":"RIGHT(DEC2HEX(HEX2DEC(X4)-16,2),2)","v":"00"}]
[16,42,{"$f":"DEC2HEX(E5,2)","v":"10"},224,16,{"$f":"Advance_curve!J17","v":45},{"$f":"Advance_curve!J18","v":47},{"$f":"Advance_curve!J19","v":50},{"$f":"Advance_curve!J20","v":52},{"$f":"Advance_curve!J21","v":55},{"$f":"Advance_curve!J22","v":57},{"$f":"Advance_curve!J23","v":60},{"$f":"Advance_curve!J24","v":63},null,{"$f":"\":\"&DEC2HEX(A5,2)&B5&C5&\"00\"&DEC2HEX(F5,2)&\"00\"&DEC2HEX(G5,2)&\"00\"&DEC2HEX(H5,2)&\"00\"&DEC2HEX(I5,2)&\"00\"&DEC2HEX(J5,2)&\"00\"&DEC2HEX(K5,2)&\"00\"&DEC2HEX(L5,2)&\"00\"&DEC2HEX(M5,2)&\"00\"&Y5","v":":104210002D002F0032003400370039003C003F0053"},null,"2D 2F 32 34   37 39 3C 3F",null,{"$f":"SUM(D5:M5)","v":669},{"$f":"DEC2HEX(S5)","v":"29D"},{"$f":"RIGHT(T5,2)","v":"9D"},{"$f":"255-HEX2DEC(U5)","v":98},99,"63","53"]
[16,42,"20",224,32,{"$f":"Advance_curve!J25","v":65},{"$f":"Advance_curve!J26","v":68},{"$f":"Advance_curve!J27","v":70},{"$f":"Advance_curve!J28","v":73},{"$f":"Advance_curve!J29","v":75},{"$f":"Advance_curve!J30","v":78},{"$f":"Advance_curve!J31","v":80},{"$f":"Advance_curve!J32","v":83},null,{"$f":"\":\"&DEC2HEX(A6,2)&B6&C6&\"00\"&DEC2HEX(F6,2)&\"00\"&DEC2HEX(G6,2)&\"00\"&DEC2HEX(H6,2)&\"00\"&DEC2HEX(I6,2)&\"00\"&DEC2HEX(J6,2)&\"00\"&DEC2HEX(K6,2)&\"00\"&DEC2HEX(L6,2)&\"00\"&DEC2HEX(M6,2)&\"00\"&Y6","v":":1042200041004400460049004B004E0050005300A0"},null,"41 44 46 49   4B 4E 50 53",null,{"$f":"SUM(D6:M6)","v":848},"350","50",175,176,"B0","A0"]
[16,42,"30",224,48,{"$f":"Advance_curve!J33","v":86},{"$f":"Advance_curve!J34","v":88},{"$f":"Advance_curve!J35","v":91},{"$f":"Advance_curve!J36","v":93},{"$f":"Advance_curve!J37","v":96},{"$f":"Advance_curve!J38","v":98},{"$f":"Advance_curve!J39","v":101},{"$f":"Advance_curve!J40","v":103},null,":10423000560058005B005D006000620065006700EC",null,"56 58 5B 5D   60 62 65 67",null,1028,"404","04",251,252,"FC","EC"]
[16,42,"40",224,64,{"$f":"Advance_curve!J41","v":106},{"$f":"Advance_curve!J42","v":109},{"$f":"Advance_curve!J43","v":111},{"$f":"Advance_curve!J44","v":114},{"$f":"Advance_curve!J45","v":116},{"$f":"Advance_curve!J46","v":119},{"$f":"Advance_curve!J47","v":121},{"$f":"Advance_curve!J48","v":124},null,":104240006A006D006F0072007400770079007C0038",null,"6A 6D 6F 72   74 77 79 7C",null,1208,"4B8","B8",71,72,"48","38"]
[16,42,"50",224,80,{"$f":"Advance_curve!J49","v":127},{"$f":"Advance_curve!J50","v":129},{"$f":"Advance_curve!J51","v":132},{"$f":"Advance_curve!J52","v":134},{"$f":"Advance_curve!J53","v":137},{"$f":"Advance_curve!J54","v":139},{"$f":"Advance_curve!J55","v":142},{"$f":"Advance_curve!J56","v":144},null,":104250007F0081008400860089008B008E00900084",null,"7F 81 84 86   89 8B 8E 90",null,1388,"56C","6C",147,148,"94","84"]
[16,42,"60",224,96,{"$f":"Advance_curve!J57","v":147},{"$f":"Advance_curve!J58","v":150},{"$f":"Advance_curve!J59","v":152},{"$f":"Advance_curve!J60","v":155},{"$f":"Advance_curve!J61","v":157},{"$f":"Advance_curve!J62","v":160},{"$f":"Advance_curve!J63","v":162},{"$f":"Advance_curve!J64","v":165},null,":104260009300960098009B009D00A000A200A500D0",null,"93 96 98 9B   9D A0 A2 A5",null,1568,"620","20",223,224,"E0","D0"]
[16,42,"70",224,112,{"$f":"Advance_curve!J65","v":167},{"$f":"Advance_curve!J66","v":170},{"$f":"Advance_curve!J67","v":173},{"$f":"Advance_curve!J68","v":175},{"$f":"Advance_curve!J69","v":178},{"$f":"Advance_curve!J70","v":180},{"$f":"Advance_curve!J71","v":183},{"$f":"Advance_curve!J72","v":185},null,":10427000A700AA00AD00AF00B200B400B700B9001D",null,"A7 AA AD AF   B2 B4 B7 B9",null,1747,"6D3","D3",44,45,"2D","1D"]
[16,42,"80",224,128,{"$f":"Advance_curve!J73","v":188},{"$f":"Advance_curve!J74","v":191},{"$f":"Advance_curve!J75","v":193},{"$f":"Advance_curve!J76","v":196},{"$f":"Advance_curve!J77","v":198},{"$f":"Advance_curve!J78","v":201},{"$f":"Advance_curve!J79","v":203},{"$f":"Advance_curve!J80","v":206},null,":10428000BC00BF00C100C400C600C900CB00CE0068",null,"BC BF C1 C4   C6 C9 CB CE",null,1928,"788","88",119,120,"78","68"]
[16,42,"90",224,144,{"$f":"Advance_curve!J81","v":209},{"$f":"Advance_curve!J82","v":211},{"$f":"Advance_curve!J83","v":214},{"$f":"Advance_curve!J84","v":216},{"$f":"Advance_curve!J85","v":219},{"$f":"Advance_curve!J86","v":221},{"$f":"Advance_curve!J87","v":224},{"$f":"Advance_curve!J88","v":226},null,":10429000D100D300D600D800DB00DD00E000E200B4",null,"D1 D3 D6 D8   DB DD E0 E2",null,2108,"83C","3C",195,196,{"$f":"IF(W13=256,\"00\",DEC2HEX(W13,2))","v":"C4"},"B4"]
[16,42,"A0",224,160,{"$f":"Advance_curve!J89","v":229},{"$f":"Advance_curve!J90","v":232},{"$f":"Advance_curve!J91","v":234},{"$f":"Advance_curve!J92","v":237},{"$f":"Advance_curve!J93","v":239},{"$f":"Advance_curve!J94","v":242},{"$f":"Advance_curve!J95","v":244},{"$f":"Advance_curve!J96","v":247},null,":1042A000E500E800EA00ED00EF00F200F400F70000",null,"E5 E8 EA ED   EF F2 F4 F7",null,2288,"8F0","F0",15,16,{"$f":"IF(W14=256,\"00\",DEC2HEX(W14,2))","v":"10"},"00"]
[16,42,"B0",224,176,{"$f":"Advance_curve!J97","v":250},{"$f":"Advance_curve!J98","v":252},{"$f":"Advance_curve!J99","v":255},{"$f":"Advance_curve!J100","v":255},{"$f":"Advance_curve!J101","v":255},{"$f":"Advance_curve!J102","v":255},{"$f":"Advance_curve!J103","v":255},0,null,":1042B000FA00FC00FF00FF00FF00FF00FF0000006F",null,"FA FC FF FF   FF FF FF 00",null,2177,"881","81",126,127,"7F","6F"]
[16,42,"C0",224,192,0,0,0,0,0,0,0,0,null,":1042C0000000000000000000000000000000000050",null,"00 00 00 00   00 00 00 00",null,416,"1A0","A0",95,96,"60","50"]
[16,42,"D0",224,208,0,0,0,0,0,0,0,0,null,":1042D0000000000000000000000000000000000040",null,"00 00 00 00   00 00 00 00",null,432,"1B0","B0",79,80,"50","40"]
[16,42,"E0",224,224,{"$f":"Advance_curve!$I$1","v":79},{"$f":"Advance_curve!$J$1","v":20},{"$f":"Advance_curve!$K$1","v":2},{"$f":"Advance_curve!$F$5","v":50},20,20,20,{"$f":"Advance_curve!$M$35","v":1},null,":1042E0004F0014000200320014001400140001005C",null,"4F 14 02 32   14 14 14 01",null,660,"294","94",107,108,"6C","5C"]
[16,42,"F0",224,240,{"$f":"VeryLowRPM!C9","v":18.204444444444444},{"$f":"INT((1/Advance_curve!$M$30)*(60*1000000)/Advance_curve!$M$34/256)","v":12},{"$f":"IF(Advance_curve!$M$32=\"Auto\",99,Advance_curve!$M$32/ 500)","v":99},{"$f":"Advance_curve!$M$30","v":2},{"$f":"advance_at_lowRPM!I2","v":15},{"$f":"Advance_curve!$J$5","v":20},{"$f":"Advance_curve!$B$9","v":11},{"$f":"Advance_curve!$B$103","v":105},null,":1042F00012000C00630002000F0014000B00690006",null,"12 0C 63 02   0F 14 0B 69",null,746.20444444444445,"2EA","EA",21,22,"16","06"]
[null,null,null,null,null,"End of File",null,null,null,null,null,null,null,null,":00000001FF"]
[]
[]
[]
[null,null,null,null,null,null,null,null,null,null,null,null,null,null,"The checksum value is the two's complement of the least significant byte (LSB) of the sum of all decoded byte values in the record that precede the checksum. "]
[null,null,null,null,null,null,null,null,null,null,null,null,null,null,"It is computed by summing the decoded byte values, extracting the LSB of the sum, and calculating the two's complement of the LSB"]
[null,null,null,null,null,null,null,null,null,null,null,null,null,null,"(e.g., by inverting its bits and adding one)."]
[null,null,null,null,null,null,null,null,null,null,null,null,null,null,"For example, in the case of the record :0300300002337A1E, the sum of the decoded byte values is 03 + 00 + 30 + 00 + 02 + 33 + 7A = E2."]
[null,null,null,null,null,null,null,null,null,null,null,null,null,null,"The two's complement of E2 is 1E, which is the checksum appearing at the end of the record."]
[]
[null,null,null,null,null,null,null,null,null,null,null,null,null,null,"Pour effectuer un complément à 2 il faut :"]
[null,null,null,null,null,null,null,null,null,null,null,null,null,null,"- Inverser tout les bits (1 en 0, 0 en 1) (ou faire 255-chiffre) Ex: DECHEX(255-SOMME(B3:K3)+1) = DECHEX(255+1-SOMME(B3:K3)) = DECHEX(256-SOMME(B3:K3))"]
[null,null,null,null,null,null,null,null,null,null,null,null,null,null," puis ajouter 1 au résultat"]
[null,null,null,null,null,null,null,null,null,null,null,null,null,null,"le complement a 2 de 0 est egal a 0"]
[null,null,null,null,null,null,null,null,null,null,null,null,null,null,"Si 2 derniers chiffres de h100 = 00: cksum OK"]
[]
[]
[null,null,null,null,null,null,null,null,null,null,null,null,null,null,"Méthode 1 (1er onglet)"]
[null,null,null,null,null,null,null,null,null,null,null,null,null,null,"C'est la méthode bestiale. On convertit le nombre (positif) en base 2, puis on inverse les bits et ensuite on ajoute 1 avec propagation d'une éventuelle retenue."]
[]
[null,null,null,null,null,null,null,null,null,null,null,null,null,null,"Méthode 2 (2ème onglet)"]
[null,null,null,null,null,null,null,null,null,null,null,null,null,null,"On utilise la formule suivante pour le complément à 2: Si X est le nombre négatif à convertir, la conversion de (2^16)-|X| en base 2 donne le résultat."]
[null,":10E000001B"]
[null,":BBAAAATTHHHHHH.....HHHHCC"]
[null,"BB est le nombre d'octets de données dans la ligne (en hexadécimal)"]
[null,"AAAA est l'adresse absolue (ou relative) du début de la lign"]
[null,"TT est le champ spécifiant le type"]
[null,"HH...HHHH est le champ des données",null,null,null,null,null,null,null,"00, données, contient les données et l'adresse 16 bit."]
[null,"CC est l'octet de checksum. C'est le complément à deux de la somme des valeurs binaires des octets de tous les autres champs. (Les calculs sont faits sur 8 bits, en ignorant les retenues.)"]
[]
[null,"Pour vérifier la validité des données, il suffit de faire la somme de tous les octets représentés, à partir des deux-points jusqu'à la fin de ligne (checksum inclus: BB+AA+AA+TT+HH+...+CC): le résultat attendu est 0 (modulo 256)."]

{"sheet":"Accuracy","index":6,"n_rows":16,"n_cols":3,"rows_kept":16,"cut":false,"hidden":false,"merged":[]}
["CYLINDRE:",1,"cyl"]
["STROKES",2,"stk"]
["ACCURACY",3.4,"us"]
[]
["RPM","ERROR"]
[0,0]
[1000,{"$f":"$B$3/((1000*(60*$B$2)/(2*$B$1*$A7))/0.36)","v":2.0399999999999998E-2}]
[2000,{"$f":"$B$3/((1000*(60*$B$2)/(2*$B$1*$A8))/0.36)","v":4.0799999999999996E-2}]
[3000,6.1199999999999997E-2]
[4000,8.1599999999999992E-2]
[5000,0.10199999999999999]
[6000,0.12239999999999999]
[7000,0.14279999999999998]
[8000,0.16319999999999998]
[9000,0.18359999999999999]
[10000,0.20399999999999999]

{"sheet":"formules","index":7,"n_rows":51,"n_cols":15,"rows_kept":51,"cut":false,"hidden":false,"merged":[[16,8,16,9],[16,11,16,12],[16,13,16,14],[17,13,17,14],[0,8,0,9],[48,2,48,5],[48,6,48,9],[49,6,49,9],[49,2,49,5],[50,2,50,9]]}
[null,null,"TEMPS","CYLINDRE","RPM","FREQUENCE","PERIODE","PERIODE","1°",null,"durée =","degrés","relatif\npickup"]
[null,null,"Nbr","Nbr","tr/mn","Hz","ms","pour 2cyl 2tps","ms","us","us",null,{"$f":"Advance_curve!F5","v":50}]
[null,null,2,1,10000,{"$f":"(2*$D$3*$E$3)/(60*$C$3)","v":166.66666666666666},{"$f":"1000*(60*$C$3)/(2*$D$3*$E$3)","v":6},{"$f":"1000*60/$E$3","v":6},{"$f":"G3/360","v":1.6666666666666666E-2},{"$f":"G3/0.36","v":16.666666666666668},1884,{"$f":"K3/J3","v":113.03999999999999},{"$f":"L3-Advance_curve!F5","v":63.039999999999992}]
[]
[null,null,null,null,{"$f":"(60*$F$5*$C$3)/(2*$D$3)","v":120},2,{"$f":"1000*(60*$C$3)/(2*$D$3*$E$5)","v":500},{"$f":"1000*60/$E$5","v":500},{"$f":"G5/360","v":1.3888888888888888},{"$f":"G5/0.36","v":1388.8888888888889},null,"FRQ = (2*CYL*RPM) / (60*TEMPS)"]
[null,null,null,null,null,null,null,null,null,null,null,"RPM = (60*FRQ*TEMPS) / ( 2*CYL)"]
[null,null,null,null,"Délai","=>","Délai","Avance",null,null,null,"1degré = (1000*1000*60*CYL) / ( 2*TEMPS*RPM)/360"]
[null,null,null,null,"us",null,"°","°"]
[null,null,null,null,60800,null,{"$f":"E9/J3","v":3647.9999999999995},{"$f":"Advance_curve!F5 -G9","v":-3597.9999999999995}]
[]
[null,null,null,null,"Frequence","=>","RPM"]
[null,null,null,null,21,"Hz",{"$f":"60*E12*$C$3/2*$D$3","v":1260}]
[]
[null,null,null,null,"Periode","=>","RPM"]
[null,null,null,null,20,"ms",{"$f":"60*(1000/E15)*$C$3/2*$D$3","v":3000}]
[]
[null,"Multiplier","Delay","Prescaler","Nombre de","Nombre","Fréquence","Régime","Période",null,"TIMER1","Delay of:",null,{"$f":"IF(O20>0,\"Avance\",\"RETARD\")","v":"RETARD"}]
[null,null,null,null,"Cylindres","de temps",null,null,null,null,"high",null,null,"BTDC"]
[null,null,"us",null,null,null,"Hz","tr/mn","ms","µs",{"$f":"IF(K20>127,\"erreur\",\"\")","v":""},"µs","ms","ms","degrees"]
[null,4,20,{"$f":"Advance_curve!M30","v":2},1,{"$f":"C3","v":2},{"$f":"F3","v":166.66666666666666},{"$f":"(G20*60*F20)/(2*E20)","v":10000},{"$f":"1000/G20","v":6},{"$f":"1000000/G20","v":6000},{"$f":"INT(J20/($D$20*255))","v":11},{"$f":" ($C$20 *$K$20*$B$20)","v":880},{"$f":"L20/1000","v":0.88},{"$f":"(I20/360)*Advance_curve!F5 - M20","v":-4.6666666666666634E-2},{"$f":"(360/I20)*N20","v":-2.799999999999998}]
[]
[]
[]
[null,"http://syskb.com/creer-une-liste-deroulante-dans-excel-2010/",null,null,null,null,null,null,null,null,null,null,null,"DUREE"]
[null,null,null,null,null,null,null,null,null,null,null,null,null,"us"]
[null,"TIMER 0",null,null,null,null,null,"Timer1",null,null,null,null,null,300]
[null,"Quartz a 4MHz",null,null,null,null,null,"Quartz a 4MHz"]
[null,"- Fosc/4 or 4MHz/4 = 1MHz",null,null,null,null,null,"- Fosc/4 or 4MHz/4 = 1MHz"]
[null,"- Prescaler sur 256 dans le registre T0CON",null,null,null,null,null,"- Prescaler sur 8 dans le registre T1CON"]
[null,"- period of the frequency input to Timer 0 :",null,null,null,null,null,"- period of the frequency input to Timer 1 :"]
[null,"1/(1MHz/256) = 256us",null,null,null,null,null,"1/(1MHz/8) = 8us"]
[null,"This is the period of time for each count in Timer 0 i.e.",null,null,null,null,null,"This is the period of time for each count in Timer 1 i.e."]
[null,"256 * 256us = 65536us = 65.636ms = 15.26Hz",null,null,null,null,null,"65536 * 8us = 525ms = 1,9Hz"]
[]
[null,"Lorsque TMR0=10, il s'est écoulé 10x256us = 2560us = 2,6ms."]
[null,"Si entre temps le moteur a fait 1 tour, c'est qu'il tourne a 2,56ms par tour"]
[null,"pour trouver des tours/mn: en 1mn (soit 60sec * 1000 = 60000ms)",null,null,null,null,null,"Calculator:"]
[null,"60000/2,56 = 23437 RPM",null,null,null,null,null,"http://eng-serve.com/pic/pic_timer.html"]
[]
[]
[null,"Conversion BIN to HEX:"]
[]
[null,"Position",8,7,6,5,4,3,2,1]
[null,"numero",7,6,5,4,3,2,1,0]
[null,"Puissance","2^3","2^2","2^1","2^0","2^3","2^2","2^1","2^0"]
[null,"Valeur 2x4bits",8,4,2,1,8,4,2,1]
[null,"Binaire",0,1,1,0,1,0,1,1]
[null,"Valeur",{"$f":"C47*C46","v":0},{"$f":"D47*D46","v":4},2,0,8,0,2,1]
[null,"2x4bits",{"$f":"C48+D48+E48+F48","v":6},null,null,null,{"$f":"G48+H48+I48+J48","v":11}]
[null,"Hexa 2x4bits",{"$f":"DEC2HEX(C49)","v":"6"},null,null,null,{"$f":"DEC2HEX(G49)","v":"B"}]
[null,"Hexa",{"$f":"CONCATENATE(C50,G50)","v":"6B"}]

{"sheet":"Calculs","index":8,"n_rows":38,"n_cols":6,"rows_kept":38,"cut":false,"hidden":false,"merged":[]}
[]
["- Tant que pickup est bas (=0) 99% du temps, on met la valeur du TIMER0 dans la variable PERL (PERiode Low)"]
["- Chaque fois que TIMER0 provoque une INTerruption de debordement lorsqu'il arrive a 255,  dans la routine d'interruption on incremente TMR0H (TIMER0 High)"]
["- Quand le pickup est haut (=1) (pulse) :"]
["- on memorise la valeur de TMR0H (Nbr de debordements de TIMER0), dans PERH (PERiode High)"]
["- et on memorise aussi la valeur du TIMER0 dans la variable PERL."]
["- puis on RAZ les timers,"]
[]
["- Ainsi la durée ecoulé entre 2 pickups est stockée dans PERL et PERH.   Soit : (PERH x 255 ) + PERL"]
[]
["Avec Q=4MHz, Prescaler = 256 et Preset = 0"]
["TIMER0 s'incremente toutes les 256us et deborde toutes les 256x256= 65536us = 65,5ms = 15,25Hz"]
["(utiliser: E:\\Pic\\Exemples\\pic_calculations.xls)"]
["- donc [ (PERH * 255 ) + PERL ] * 65,5ms = durée entre 2 pulses."]
[]
["- Dans le soft:"]
["- on regarde si PERH est > a une certaine valeur, auquel cas le moteur tourne très lentement"]
["- on regarde si PERL est < a une certaine valeur, auquel cas le moteur tourne trop vite => arret des sparks pour limiter le regime"]
["- on regarde si PERL est < a une certaine valeur, auquel cas le moteur tourne très vite => spark immediat (sans avance)"]
["- entre ces 2 limites, on lit un tableau qui retourne un chiffre (delay) pour chacune des 95 valeurs de PERL"]
["- ce DELAY est le temps d'attente (nbr de boucles d'atttente) avant d'envoyer le spark"]
[]
["Propriete de l'interruption:"]
[]
[]
[null,null,null,null,null,"Liste deroulante"]
[null,null,null,null,null,"selectionner la cellule "]
[null,null,null,null,null,"donnees> validité des données> validite des donnees > afficher: liste"]
[]
[]
[]
[]
[]
[]
[]
[]
[]
["A 15,4Hz = 924RPM, il faut 64935us pour faire un tour, donc TIMER0 a le temps d'aller jusqu’à 254 et de presque deborder:"]

{"sheet":"Excel","index":9,"n_rows":10,"n_cols":3,"rows_kept":10,"cut":false,"hidden":false,"merged":[]}
[]
[]
["Conversion de valeurs: ",null,"=SI(I2=2;2;(SI(I2=3;3;(SI(I2=4;4;(SI(I2=5;5;(SI(I2=6;6)))))))))"]
[]
["Liste deroulante: ",null,"Donnees> Validite des donnees"]
[]
[]
["les graphes n'affichent pas la valeur #N/A  , utiliser #N/A pour faire disparaitre les points du graphe"]
[]
["Pour afficher les liens d'une cellule: selectionner la > Formule > Reperer les antécédents ou dependants "]

{"sheet":"calibrage","index":10,"n_rows":33,"n_cols":24,"rows_kept":33,"cut":false,"hidden":false,"merged":[]}
[null,null,null,null,null,"avec pickup\n de 50us","avec DAC\n duree proportionnelle",null,"mesure \nN°1\noscillo","correction1",null,"mesure \nN°2\noscillo",null,null,"mesure N°2\noscillo",null,null,"mesure\n N°2\noscillo",null,null,"mesure\n N°3\noscillo"]
[null,"RPM","HZ","ms","us","L","L",null,"ms","L",null,null,null,null,"ms",null,null,"ms",null,null,"ms"]
[1,1000,{"$f":"(2*formules!$D$3*B3)/(60*formules!$C$3)","v":16.666666666666668},{"$f":"1000*(60*formules!$C$3)/(2*formules!$D$3*B3)","v":60},{"$f":"D3*1000","v":60000},null,62000,{"$f":"CONCATENATE($X3,\" = \",G3)","v":"FREQUENCE[1] = 62000"},70.400000000000006,52800,{"$f":"CONCATENATE($X3,\" = \",J3)","v":"FREQUENCE[1] = 52800"},60.8,52000,{"$f":"CONCATENATE($X3,\" = \",M3)","v":"FREQUENCE[1] = 52000"},60,52000,{"$f":"CONCATENATE($X3,\" = \",P3)","v":"FREQUENCE[1] = 52000"},60,52000,{"$f":"CONCATENATE($X3,\" = \",S3)","v":"FREQUENCE[1] = 52000"},null,52000,{"$f":"CONCATENATE($X3,\" = \",V3)","v":"FREQUENCE[1] = 52000"},{"$f":"CONCATENATE(\"FREQUENCE[\",A3,\"]\")","v":"FREQUENCE[1]"}]
[2,1500,{"$f":"(2*formules!$D$3*B4)/(60*formules!$C$3)","v":25},{"$f":"1000*(60*formules!$C$3)/(2*formules!$D$3*B4)","v":40},{"$f":"D4*1000","v":40000},null,34500,{"$f":"CONCATENATE(X4,\" = \",G4)","v":"FREQUENCE[2] = 34500"},null,0,{"$f":"CONCATENATE($X4,\" = \",J4)","v":"FREQUENCE[2] = 0"},null,0,{"$f":"CONCATENATE($X4,\" = \",M4)","v":"FREQUENCE[2] = 0"},null,0,{"$f":"CONCATENATE($X4,\" = \",P4)","v":"FREQUENCE[2] = 0"},null,0,{"$f":"CONCATENATE($X4,\" = \",S4)","v":"FREQUENCE[2] = 0"},null,0,{"$f":"CONCATENATE($X4,\" = \",V4)","v":"FREQUENCE[2] = 0"},"FREQUENCE[2]"]
[3,2000,{"$f":"(2*formules!$D$3*B5)/(60*formules!$C$3)","v":33.333333333333336},{"$f":"1000*(60*formules!$C$3)/(2*formules!$D$3*B5)","v":30},30000,27320,26670,"FREQUENCE[3] = 26670",31.6,24700,"FREQUENCE[3] = 24700",30,24700,"FREQUENCE[3] = 24700",29.4,25200,"FREQUENCE[3] = 25200",30,25200,"FREQUENCE[3] = 25200",null,25200,"FREQUENCE[3] = 25200","FREQUENCE[3]"]
[4,2500,{"$f":"(2*formules!$D$3*B6)/(60*formules!$C$3)","v":41.666666666666664},{"$f":"1000*(60*formules!$C$3)/(2*formules!$D$3*B6)","v":24},24000,21870,21300,"FREQUENCE[4] = 21300",null,0,"FREQUENCE[4] = 0",null,0,"FREQUENCE[4] = 0",null,0,"FREQUENCE[4] = 0",null,0,"FREQUENCE[4] = 0",null,0,"FREQUENCE[4] = 0","FREQUENCE[4]"]
[5,3000,{"$f":"(2*formules!$D$3*B7)/(60*formules!$C$3)","v":50},{"$f":"1000*(60*formules!$C$3)/(2*formules!$D$3*B7)","v":20},20000,18190,17670,"FREQUENCE[5] = 17670",21.6,16360,"FREQUENCE[5] = 16360",20.399999999999999,16040,"FREQUENCE[5] = 16040",19.7,16280,"FREQUENCE[5] = 16280",20,16280,"FREQUENCE[5] = 16280",null,16280,"FREQUENCE[5] = 16280","FREQUENCE[5]"]
[6,3500,{"$f":"(2*formules!$D$3*B8)/(60*formules!$C$3)","v":58.333333333333336},{"$f":"1000*(60*formules!$C$3)/(2*formules!$D$3*B8)","v":17.142857142857142},17142.857142857141,15600,15070,"FREQUENCE[6] = 15070",null,0,"FREQUENCE[6] = 0",null,0,"FREQUENCE[6] = 0",null,0,"FREQUENCE[6] = 0",null,0,"FREQUENCE[6] = 0",null,0,"FREQUENCE[6] = 0","FREQUENCE[6]"]
[7,4000,{"$f":"(2*formules!$D$3*B9)/(60*formules!$C$3)","v":66.666666666666671},{"$f":"1000*(60*formules!$C$3)/(2*formules!$D$3*B9)","v":15},15000,13580,13100,"FREQUENCE[7] = 13100",16.600000000000001,11800,"FREQUENCE[7] = 11800",15,11800,"FREQUENCE[7] = 11800",14.7,12040,"FREQUENCE[7] = 12040",15.3,11800,"FREQUENCE[7] = 11800",null,11800,"FREQUENCE[7] = 11800","FREQUENCE[7]"]
[8,4500,{"$f":"(2*formules!$D$3*B10)/(60*formules!$C$3)","v":75},{"$f":"1000*(60*formules!$C$3)/(2*formules!$D$3*B10)","v":13.333333333333334},13333.333333333334,12149,11610,"FREQUENCE[8] = 11610",null,0,"FREQUENCE[8] = 0",null,0,"FREQUENCE[8] = 0",null,0,"FREQUENCE[8] = 0",null,0,"FREQUENCE[8] = 0",null,0,"FREQUENCE[8] = 0","FREQUENCE[8]"]
[9,5000,{"$f":"(2*formules!$D$3*B11)/(60*formules!$C$3)","v":83.333333333333329},{"$f":"1000*(60*formules!$C$3)/(2*formules!$D$3*B11)","v":12},12000,10958,10410,"FREQUENCE[9] = 10410",13.5,9200,"FREQUENCE[9] = 9200",12.2,9050,"FREQUENCE[9] = 9050",12,9050,"FREQUENCE[9] = 9050",11.9,9120,"FREQUENCE[9] = 9120",12,9120,"FREQUENCE[9] = 9120","FREQUENCE[9]"]
[10,5500,{"$f":"(2*formules!$D$3*B12)/(60*formules!$C$3)","v":91.666666666666671},{"$f":"1000*(60*formules!$C$3)/(2*formules!$D$3*B12)","v":10.909090909090908},10909.090909090908,9980,9410,"FREQUENCE[10] = 9410",null,0,"FREQUENCE[10] = 0",null,0,"FREQUENCE[10] = 0",null,0,"FREQUENCE[10] = 0",null,0,"FREQUENCE[10] = 0",null,0,"FREQUENCE[10] = 0","FREQUENCE[10]"]
[11,6000,{"$f":"(2*formules!$D$3*B13)/(60*formules!$C$3)","v":100},{"$f":"1000*(60*formules!$C$3)/(2*formules!$D$3*B13)","v":10},10000,9136,8580,"FREQUENCE[11] = 8580",11.6,7400,"FREQUENCE[11] = 7400",10.3,7180,"FREQUENCE[11] = 7180",9.9,7250,"FREQUENCE[11] = 7250",10,7250,"FREQUENCE[11] = 7250",null,7250,"FREQUENCE[11] = 7250","FREQUENCE[11]"]
[12,6500,{"$f":"(2*formules!$D$3*B14)/(60*formules!$C$3)","v":108.33333333333333},{"$f":"1000*(60*formules!$C$3)/(2*formules!$D$3*B14)","v":9.2307692307692299},9230.7692307692305,8408,7900,"FREQUENCE[12] = 7900",null,0,"FREQUENCE[12] = 0",null,0,"FREQUENCE[12] = 0",null,0,"FREQUENCE[12] = 0",null,0,"FREQUENCE[12] = 0",null,0,"FREQUENCE[12] = 0","FREQUENCE[12]"]
[13,7000,{"$f":"(2*formules!$D$3*B15)/(60*formules!$C$3)","v":116.66666666666667},{"$f":"1000*(60*formules!$C$3)/(2*formules!$D$3*B15)","v":8.5714285714285712},8571.4285714285706,7730,7280,"FREQUENCE[13] = 7280",10.1,6100,"FREQUENCE[13] = 6100",8.8000000000000007,5950,"FREQUENCE[13] = 5950",8.6,5950,"FREQUENCE[13] = 5950",8.5,6000,"FREQUENCE[13] = 6000",8.6,6000,"FREQUENCE[13] = 6000","FREQUENCE[13]"]
[14,7500,{"$f":"(2*formules!$D$3*B16)/(60*formules!$C$3)","v":125},{"$f":"1000*(60*formules!$C$3)/(2*formules!$D$3*B16)","v":8},8000,7310,6760,"FREQUENCE[14] = 6760",null,0,"FREQUENCE[14] = 0",null,0,"FREQUENCE[14] = 0",null,0,"FREQUENCE[14] = 0",null,0,"FREQUENCE[14] = 0",null,0,"FREQUENCE[14] = 0","FREQUENCE[14]"]
[15,8000,{"$f":"(2*formules!$D$3*B17)/(60*formules!$C$3)","v":133.33333333333334},{"$f":"1000*(60*formules!$C$3)/(2*formules!$D$3*B17)","v":7.5},7500,6850,6310,"FREQUENCE[15] = 6310",9,5260,"FREQUENCE[15] = 5260",7.8,5060,"FREQUENCE[15] = 5060",7.5,5060,"FREQUENCE[15] = 5060",7.5,5060,"FREQUENCE[15] = 5060",7.48,5060,"FREQUENCE[15] = 5060","FREQUENCE[15]"]
[16,8500,{"$f":"(2*formules!$D$3*B18)/(60*formules!$C$3)","v":141.66666666666666},{"$f":"1000*(60*formules!$C$3)/(2*formules!$D$3*B18)","v":7.0588235294117645},7058.8235294117649,6435,5900,"FREQUENCE[16] = 5900",null,0,"FREQUENCE[16] = 0",null,0,"FREQUENCE[16] = 0",null,0,"FREQUENCE[16] = 0",null,0,"FREQUENCE[16] = 0",null,0,"FREQUENCE[16] = 0","FREQUENCE[16]"]
[17,9000,{"$f":"(2*formules!$D$3*B19)/(60*formules!$C$3)","v":150},{"$f":"1000*(60*formules!$C$3)/(2*formules!$D$3*B19)","v":6.666666666666667},6666.666666666667,6100,5550,"FREQUENCE[17] = 5550",8.1,4600,"FREQUENCE[17] = 4600",7.1,4340,"FREQUENCE[17] = 4340",6.8,5890,"FREQUENCE[17] = 5890",8.5,4500,"FREQUENCE[17] = 4500",6.88,4320,"FREQUENCE[17] = 4320","FREQUENCE[17]"]
[18,9500,{"$f":"(2*formules!$D$3*B20)/(60*formules!$C$3)","v":158.33333333333334},{"$f":"1000*(60*formules!$C$3)/(2*formules!$D$3*B20)","v":6.3157894736842106},6315.7894736842109,5770,5230,"FREQUENCE[18] = 5230",null,0,"FREQUENCE[18] = 0",null,0,"FREQUENCE[18] = 0",null,0,"FREQUENCE[18] = 0",null,0,"FREQUENCE[18] = 0",null,0,"FREQUENCE[18] = 0","FREQUENCE[18]"]
[19,10000,{"$f":"(2*formules!$D$3*B21)/(60*formules!$C$3)","v":166.66666666666666},{"$f":"1000*(60*formules!$C$3)/(2*formules!$D$3*B21)","v":6},6000,5490,4950,"FREQUENCE[19] = 4950",7.5,3960,"FREQUENCE[19] = 3960",6.3,3760,"FREQUENCE[19] = 3760",6.1,3680,"FREQUENCE[19] = 3680",6,3680,"FREQUENCE[19] = 3680",5.96,3680,"FREQUENCE[19] = 3680","FREQUENCE[19]"]
[20,10500,{"$f":"(2*formules!$D$3*B22)/(60*formules!$C$3)","v":175},{"$f":"1000*(60*formules!$C$3)/(2*formules!$D$3*B22)","v":5.7142857142857144},5714.2857142857147,5220,4680,"FREQUENCE[20] = 4680",null,0,"FREQUENCE[20] = 0",null,0,"FREQUENCE[20] = 0",null,0,"FREQUENCE[20] = 0",null,0,"FREQUENCE[20] = 0",null,0,"FREQUENCE[20] = 0","FREQUENCE[20]"]
[21,11000,{"$f":"(2*formules!$D$3*B23)/(60*formules!$C$3)","v":183.33333333333334},{"$f":"1000*(60*formules!$C$3)/(2*formules!$D$3*B23)","v":5.4545454545454541},5454.545454545454,4990,4440,"FREQUENCE[21] = 4440",7,3500,"FREQUENCE[21] = 3500",5.9,3220,"FREQUENCE[21] = 3220",5.5,3220,"FREQUENCE[21] = 3220",5.5,3220,"FREQUENCE[21] = 3220",5.52,3220,"FREQUENCE[21] = 3220","FREQUENCE[21]"]
[22,11500,{"$f":"(2*formules!$D$3*B24)/(60*formules!$C$3)","v":191.66666666666666},{"$f":"1000*(60*formules!$C$3)/(2*formules!$D$3*B24)","v":5.2173913043478262},5217.391304347826,4780,4230,"FREQUENCE[22] = 4230",null,0,"FREQUENCE[22] = 0",null,0,"FREQUENCE[22] = 0",null,0,"FREQUENCE[22] = 0",null,0,"FREQUENCE[22] = 0",null,0,"FREQUENCE[22] = 0","FREQUENCE[22]"]
[23,12000,{"$f":"(2*formules!$D$3*B25)/(60*formules!$C$3)","v":200},{"$f":"1000*(60*formules!$C$3)/(2*formules!$D$3*B25)","v":5},5000,4380,4030,"FREQUENCE[23] = 4030",6.5,3100,"FREQUENCE[23] = 3100",5.3,2900,"FREQUENCE[23] = 2900",5.2,2760,"FREQUENCE[23] = 2760",5,2760,"FREQUENCE[23] = 2760",4.96,2760,"FREQUENCE[23] = 2760","FREQUENCE[23]"]
[24,12500,{"$f":"(2*formules!$D$3*B26)/(60*formules!$C$3)","v":208.33333333333334},{"$f":"1000*(60*formules!$C$3)/(2*formules!$D$3*B26)","v":4.8},4800,4390,3870,"FREQUENCE[24] = 3870",null,0,"FREQUENCE[24] = 0",null,0,"FREQUENCE[24] = 0",null,0,"FREQUENCE[24] = 0",null,0,"FREQUENCE[24] = 0",null,0,"FREQUENCE[24] = 0","FREQUENCE[24]"]
[25,13000,{"$f":"(2*formules!$D$3*B27)/(60*formules!$C$3)","v":216.66666666666666},{"$f":"1000*(60*formules!$C$3)/(2*formules!$D$3*B27)","v":4.615384615384615},4615.3846153846152,null,3680,"FREQUENCE[25] = 3680",6.1,2770,"FREQUENCE[25] = 2770",5,2500,"FREQUENCE[25] = 2500",4.5999999999999996,2500,"FREQUENCE[25] = 2500",4.7,2450,"FREQUENCE[25] = 2450",4.5999999999999996,2450,"FREQUENCE[25] = 2450","FREQUENCE[25]"]
[26,13500,{"$f":"(2*formules!$D$3*B28)/(60*formules!$C$3)","v":225},{"$f":"1000*(60*formules!$C$3)/(2*formules!$D$3*B28)","v":4.4444444444444446},4444.4444444444443,null,3530,"FREQUENCE[26] = 3530",null,0,"FREQUENCE[26] = 0",null,0,"FREQUENCE[26] = 0",null,0,"FREQUENCE[26] = 0",null,0,"FREQUENCE[26] = 0",null,0,"FREQUENCE[26] = 0","FREQUENCE[26]"]
[27,14000,{"$f":"(2*formules!$D$3*B29)/(60*formules!$C$3)","v":233.33333333333334},{"$f":"1000*(60*formules!$C$3)/(2*formules!$D$3*B29)","v":4.2857142857142856},4285.7142857142853,null,3380,"FREQUENCE[27] = 3380",5.8,2500,"FREQUENCE[27] = 2500",4.7,2250,"FREQUENCE[27] = 2250",4.4000000000000004,2180,"FREQUENCE[27] = 2180",4.3,2180,"FREQUENCE[27] = 2180",4.32,2180,"FREQUENCE[27] = 2180","FREQUENCE[27]"]
[]
[]
[null,"Temps incompressible:",null,"avec délai = 0 dans l'eprom, il faut 71us entre la detection pickup haut et spark"]
[null,null,null,"avec délai = 1 dans l'eprom, il faut 91us entre la detection pickup haut et spark (soit 71us +20us)"]

{"sheet":"Dwell variable","index":11,"n_rows":98,"n_cols":5,"rows_kept":98,"cut":false,"hidden":false,"merged":[]}
[]
[null,null,null,"coef:","DWELL = PERIODE * 50"]
[null,{"$f":"Advance_curve!B8","v":"TIMER1H count"},null,50]
[null,{"$f":"Advance_curve!B9","v":11},{"$f":"$D$3*Advance_curve!B9","v":550},"µs"]
[null,{"$f":"Advance_curve!B10","v":12},{"$f":"$D$3*Advance_curve!B10","v":600}]
[null,{"$f":"Advance_curve!B11","v":13},{"$f":"$D$3*Advance_curve!B11","v":650}]
[null,{"$f":"Advance_curve!B12","v":14},{"$f":"$D$3*Advance_curve!B12","v":700}]
[null,{"$f":"Advance_curve!B13","v":15},{"$f":"$D$3*Advance_curve!B13","v":750}]
[null,{"$f":"Advance_curve!B14","v":16},{"$f":"$D$3*Advance_curve!B14","v":800}]
[null,{"$f":"Advance_curve!B15","v":17},{"$f":"$D$3*Advance_curve!B15","v":850}]
[null,{"$f":"Advance_curve!B16","v":18},{"$f":"$D$3*Advance_curve!B16","v":900}]
[null,{"$f":"Advance_curve!B17","v":19},{"$f":"$D$3*Advance_curve!B17","v":950}]
[null,{"$f":"Advance_curve!B18","v":20},{"$f":"$D$3*Advance_curve!B18","v":1000}]
[null,{"$f":"Advance_curve!B19","v":21},{"$f":"$D$3*Advance_curve!B19","v":1050}]
[null,{"$f":"Advance_curve!B20","v":22},{"$f":"$D$3*Advance_curve!B20","v":1100}]
[null,{"$f":"Advance_curve!B21","v":23},{"$f":"$D$3*Advance_curve!B21","v":1150}]
[null,{"$f":"Advance_curve!B22","v":24},{"$f":"$D$3*Advance_curve!B22","v":1200}]
[null,{"$f":"Advance_curve!B23","v":25},{"$f":"$D$3*Advance_curve!B23","v":1250}]
[null,{"$f":"Advance_curve!B24","v":26},{"$f":"$D$3*Advance_curve!B24","v":1300}]
[null,{"$f":"Advance_curve!B25","v":27},{"$f":"$D$3*Advance_curve!B25","v":1350}]
[null,{"$f":"Advance_curve!B26","v":28},{"$f":"$D$3*Advance_curve!B26","v":1400}]
[null,{"$f":"Advance_curve!B27","v":29},{"$f":"$D$3*Advance_curve!B27","v":1450}]
[null,{"$f":"Advance_curve!B28","v":30},{"$f":"$D$3*Advance_curve!B28","v":1500}]
[null,{"$f":"Advance_curve!B29","v":31},{"$f":"$D$3*Advance_curve!B29","v":1550}]
[null,{"$f":"Advance_curve!B30","v":32},{"$f":"$D$3*Advance_curve!B30","v":1600}]
[null,{"$f":"Advance_curve!B31","v":33},{"$f":"$D$3*Advance_curve!B31","v":1650}]
[null,{"$f":"Advance_curve!B32","v":34},{"$f":"$D$3*Advance_curve!B32","v":1700}]
[null,{"$f":"Advance_curve!B33","v":35},{"$f":"$D$3*Advance_curve!B33","v":1750}]
[null,{"$f":"Advance_curve!B34","v":36},{"$f":"$D$3*Advance_curve!B34","v":1800}]
[null,{"$f":"Advance_curve!B35","v":37},{"$f":"$D$3*Advance_curve!B35","v":1850}]
[null,{"$f":"Advance_curve!B36","v":38},{"$f":"$D$3*Advance_curve!B36","v":1900}]
[null,{"$f":"Advance_curve!B37","v":39},{"$f":"$D$3*Advance_curve!B37","v":1950}]
[null,{"$f":"Advance_curve!B38","v":40},{"$f":"$D$3*Advance_curve!B38","v":2000}]
[null,{"$f":"Advance_curve!B39","v":41},{"$f":"$D$3*Advance_curve!B39","v":2050}]
[null,{"$f":"Advance_curve!B40","v":42},{"$f":"$D$3*Advance_curve!B40","v":2100}]
[null,{"$f":"Advance_curve!B41","v":43},{"$f":"$D$3*Advance_curve!B41","v":2150}]
[null,{"$f":"Advance_curve!B42","v":44},{"$f":"$D$3*Advance_curve!B42","v":2200}]
[null,{"$f":"Advance_curve!B43","v":45},{"$f":"$D$3*Advance_curve!B43","v":2250}]
[null,{"$f":"Advance_curve!B44","v":46},{"$f":"$D$3*Advance_curve!B44","v":2300}]
[null,{"$f":"Advance_curve!B45","v":47},{"$f":"$D$3*Advance_curve!B45","v":2350}]
[null,{"$f":"Advance_curve!B46","v":48},{"$f":"$D$3*Advance_curve!B46","v":2400}]
[null,{"$f":"Advance_curve!B47","v":49},{"$f":"$D$3*Advance_curve!B47","v":2450}]
[null,{"$f":"Advance_curve!B48","v":50},{"$f":"$D$3*Advance_curve!B48","v":2500}]
[null,{"$f":"Advance_curve!B49","v":51},{"$f":"$D$3*Advance_curve!B49","v":2550}]
[null,{"$f":"Advance_curve!B50","v":52},{"$f":"$D$3*Advance_curve!B50","v":2600}]
[null,{"$f":"Advance_curve!B51","v":53},{"$f":"$D$3*Advance_curve!B51","v":2650}]
[null,{"$f":"Advance_curve!B52","v":54},{"$f":"$D$3*Advance_curve!B52","v":2700}]
[null,{"$f":"Advance_curve!B53","v":55},{"$f":"$D$3*Advance_curve!B53","v":2750}]
[null,{"$f":"Advance_curve!B54","v":56},{"$f":"$D$3*Advance_curve!B54","v":2800}]
[null,{"$f":"Advance_curve!B55","v":57},{"$f":"$D$3*Advance_curve!B55","v":2850}]
[null,{"$f":"Advance_curve!B56","v":58},{"$f":"$D$3*Advance_curve!B56","v":2900}]
[null,{"$f":"Advance_curve!B57","v":59},{"$f":"$D$3*Advance_curve!B57","v":2950}]
[null,{"$f":"Advance_curve!B58","v":60},{"$f":"$D$3*Advance_curve!B58","v":3000}]
[null,{"$f":"Advance_curve!B59","v":61},{"$f":"$D$3*Advance_curve!B59","v":3050}]
[null,{"$f":"Advance_curve!B60","v":62},{"$f":"$D$3*Advance_curve!B60","v":3100}]
[null,{"$f":"Advance_curve!B61","v":63},{"$f":"$D$3*Advance_curve!B61","v":3150}]
[null,{"$f":"Advance_curve!B62","v":64},{"$f":"$D$3*Advance_curve!B62","v":3200}]
[null,{"$f":"Advance_curve!B63","v":65},{"$f":"$D$3*Advance_curve!B63","v":3250}]
[null,{"$f":"Advance_curve!B64","v":66},{"$f":"$D$3*Advance_curve!B64","v":3300}]
[null,{"$f":"Advance_curve!B65","v":67},{"$f":"$D$3*Advance_curve!B65","v":3350}]
[null,{"$f":"Advance_curve!B66","v":68},{"$f":"$D$3*Advance_curve!B66","v":3400}]
[null,{"$f":"Advance_curve!B67","v":69},{"$f":"$D$3*Advance_curve!B67","v":3450}]
[null,{"$f":"Advance_curve!B68","v":70},{"$f":"$D$3*Advance_curve!B68","v":3500}]
[null,{"$f":"Advance_curve!B69","v":71},{"$f":"$D$3*Advance_curve!B69","v":3550}]
[null,{"$f":"Advance_curve!B70","v":72},{"$f":"$D$3*Advance_curve!B70","v":3600}]
[null,{"$f":"Advance_curve!B71","v":73},{"$f":"$D$3*Advance_curve!B71","v":3650}]
[null,{"$f":"Advance_curve!B72","v":74},{"$f":"$D$3*Advance_curve!B72","v":3700}]
[null,{"$f":"Advance_curve!B73","v":75},{"$f":"$D$3*Advance_curve!B73","v":3750}]
[null,{"$f":"Advance_curve!B74","v":76},{"$f":"$D$3*Advance_curve!B74","v":3800}]
[null,{"$f":"Advance_curve!B75","v":77},{"$f":"$D$3*Advance_curve!B75","v":3850}]
[null,{"$f":"Advance_curve!B76","v":78},{"$f":"$D$3*Advance_curve!B76","v":3900}]
[null,{"$f":"Advance_curve!B77","v":79},{"$f":"$D$3*Advance_curve!B77","v":3950}]
[null,{"$f":"Advance_curve!B78","v":80},{"$f":"$D$3*Advance_curve!B78","v":4000}]
[null,{"$f":"Advance_curve!B79","v":81},{"$f":"$D$3*Advance_curve!B79","v":4050}]
[null,{"$f":"Advance_curve!B80","v":82},{"$f":"$D$3*Advance_curve!B80","v":4100}]
[null,{"$f":"Advance_curve!B81","v":83},{"$f":"$D$3*Advance_curve!B81","v":4150}]
[null,{"$f":"Advance_curve!B82","v":84},{"$f":"$D$3*Advance_curve!B82","v":4200}]
[null,{"$f":"Advance_curve!B83","v":85},{"$f":"$D$3*Advance_curve!B83","v":4250}]
[null,{"$f":"Advance_curve!B84","v":86},{"$f":"$D$3*Advance_curve!B84","v":4300}]
[null,{"$f":"Advance_curve!B85","v":87},{"$f":"$D$3*Advance_curve!B85","v":4350}]
[null,{"$f":"Advance_curve!B86","v":88},{"$f":"$D$3*Advance_curve!B86","v":4400}]
[null,{"$f":"Advance_curve!B87","v":89},{"$f":"$D$3*Advance_curve!B87","v":4450}]
[null,{"$f":"Advance_curve!B88","v":90},{"$f":"$D$3*Advance_curve!B88","v":4500}]
[null,{"$f":"Advance_curve!B89","v":91},{"$f":"$D$3*Advance_curve!B89","v":4550}]
[null,{"$f":"Advance_curve!B90","v":92},{"$f":"$D$3*Advance_curve!B90","v":4600}]
[null,{"$f":"Advance_curve!B91","v":93},{"$f":"$D$3*Advance_curve!B91","v":4650}]
[null,{"$f":"Advance_curve!B92","v":94},{"$f":"$D$3*Advance_curve!B92","v":4700}]
[null,{"$f":"Advance_curve!B93","v":95},{"$f":"$D$3*Advance_curve!B93","v":4750}]
[null,{"$f":"Advance_curve!B94","v":96},{"$f":"$D$3*Advance_curve!B94","v":4800}]
[null,{"$f":"Advance_curve!B95","v":97},{"$f":"$D$3*Advance_curve!B95","v":4850}]
[null,{"$f":"Advance_curve!B96","v":98},{"$f":"$D$3*Advance_curve!B96","v":4900}]
[null,{"$f":"Advance_curve!B97","v":99},{"$f":"$D$3*Advance_curve!B97","v":4950}]
[null,{"$f":"Advance_curve!B98","v":100},{"$f":"$D$3*Advance_curve!B98","v":5000}]
[null,{"$f":"Advance_curve!B99","v":101},{"$f":"$D$3*Advance_curve!B99","v":5050}]
[null,{"$f":"Advance_curve!B100","v":102},{"$f":"$D$3*Advance_curve!B100","v":5100}]
[null,{"$f":"Advance_curve!B101","v":103},{"$f":"$D$3*Advance_curve!B101","v":5150}]
[null,{"$f":"Advance_curve!B102","v":104},{"$f":"$D$3*Advance_curve!B102","v":5200}]
[null,{"$f":"Advance_curve!B103","v":105},{"$f":"$D$3*Advance_curve!B103","v":5250}]

{"sheet":"Version","index":12,"n_rows":35,"n_cols":2,"rows_kept":35,"cut":false,"hidden":false,"merged":[]}
[]
[]
[]
["v7.9r13c2","[HARD] Correction RA1 forcé a 1, car pullup R5 sur PCB"]
["v7.9r13c3","[XLS] Valeur de dwell passe de 2 choix (500,1000) a 6 choix (500,1000,2000,3000,4000,5000)."]
["v7.9r14c0","[SOFT,XLS] Ajout d'une valeur de dwell \"AUTO\" pour lequel la durée de dwell est proportionnelle a PERIODE."]
["v7.9r14c1","[SOFT] Code protection OFF"]
["v7.9r15c0","[XLS] La valeur d'avance affichée dans l'onglet \"advance_at_lowRPM\" ne prenait pas en compte la position du pickup, c'était donc une valeur RELATIVE, pas ABSOLUE. Multiplicateur peut descendre a 1 (soft OK)"]
[null,"[SOFT] si JP2 a la masse alors PIC bypass la courbe d'avance et envoi spark dés que detection front descendant du pickup"]
[null,"[SOFT] RB3 (ex TP2) n'était pas forcé en OUTPUT"]
[null,"[HARD] Suppression TP2 inutile"]
[null,"[HARD] Reduction R7 de 330 a 180 (Sinon ne declenche pas les SCR de type BTA)."]
[null,"[HARD] Suppression C9-100n car courant d'appel dépasse Imax du PIC"]
["v7.9r16c0","[XLS] La valeur d'avance affichée dans l'onglet \"advance_at_lowRPM\" était fausse."]
[null,"[SOFT] boucles d'attente pkp haut et bas en ASM: Precision x10 !!"]
[null,"[XLS] Ajout documentation onglet README"]
["v7.9r16c1","[XLS] Tuning: a low RPM, le PIC attend 4us x PERIODE mais en vrai bcl dure plus de 4us, du coup il y a un offset de 5deg (20° affiché et 15° reels)\npour simplifier correction: la valeur delay (I1) passe de 4 a 4.4"]
[null,"[SOFT] Calibration de la boucle 40us"]
["v7.9r17c0","[XLS] Ajout d'un Rev Limiter a l'adresse Eprom 121 si swich JP2 a la masse"]
[null,"[SOFT] JP2 (ex Bypass curve) est utilisé pour activer une limitation de RPM inferieur au maxi et stocké en @121 de l'eprom (Scooter légal)"]
["v7.9r17c1","[XLS] Renommage en accord avec code. Ajout RPM mini dans le titre onglet low_rpm"]
["v7.9r18c0","[XLS] Ajout d'un délai at Kick Start selectionnable par le user"]
[null,"[SOFT] Si TMR1 déborde, PIC attend une pause d'une durée fixe VLRPM qui a été définie par le user et écrite en eprom. Sinon spark immediate entre 0 et 480RPM car TMR1 = 0 = croit que RPM élévés"]
["v7.9r19c0","[XLS] Ajout step 200us permet de positionner le pkp jusqu’à 360° btdc"]
[null,"[SOFT] Ajout step 200us permet de positionner le pkp jusqu’à 360° btdc"]
[null,"[SOFT] Si TMR1 déborde, PIC attend une pause de Nbr débordements * VLRPM qui a été définie par le user et écrite en eprom. Sinon spark immediate entre 0 et 480RPM car TMR1 = 0 = croit que RPM élévés"]
["v7.9r20c0","[SOFT] Suppresion JP1: autospark et RB3 output PWM"]
[null,"[SOFT] RB3 devient RevCoil, RB5 devient sortie Tacho, meme signal que RA2"]
[null,"[SOFT] Lecture de JP2 (rev limit) dés que pkp repasse a 1, donc possible de changer rpm limit pendant la marche"]
[null,"[XLS] Modif commentaire dwell, Renommage en ACCDI_v79r20c0 (au lieu curve_adjust_16f628_xxxx)"]
[null,"[XLS] Ajout onglet EPROM16 pour configurer 16F628 directement avec pickit3 sans besoin de icprog"]
["v7.9r20c1","[XLS] Modif choix 2,4 stk wasted spark"]
[null,"[XLS] Correction. Le temps en us pour 1° changeait selon 2 ou 4tps ! (faux en 4)"]
["v7.9r20c2","[XLS] Ajout \"led diagnostic reset\" @ 119"]
[null,"[SOFT] Si LED@119 = 0 alors pas de clignotement led pour diagnostiquer dernier reset"]