{"text_format":"1","workbook":"xlsx","n_sheets":10,"sheets":["README","Advance_curve","LowRPM","EEPROM16","Accuracy","formules","Calculs","Dwell variable","Version","Excel"],"not_rendered":{"charts":6,"images":3,"macros":0,"external_links":0,"defined_names":2,"comments":4,"pivot_tables":0},"unopened":[],"bounds":{"document_bytes":16777216,"sheet_cells":100000,"rows_first":2000,"rows_last":500,"rows_between":2000,"halvings":0,"cell_chars":16384,"cell_head_chars":4096},"cells_cut":0,"cells_raw":0,"read":"whole","date_system":"1900"}

{"sheet":"README","index":0,"n_rows":19,"n_cols":8,"rows_kept":19,"cut":false,"hidden":false,"merged":[]}
[]
[null,"With the values your entered, the CDI behavior will be the following:"]
[]
[null,null,null,null,null,null,null,"Where to change that?"]
[]
[]
["A) ",{"$f":"CONCATENATE(\"Flat advance from \",LowRPM!L7,\" to \",Advance_curve!C7,\" RPM\")","v":"Flat advance from 76 to 643 RPM"},null,null,null,null,null,"cell I2 in tab \"lowRPM\""]
[]
["B)",{"$f":"CONCATENATE(\"Advance curve is freely adjustable from \",Advance_curve!C7, \" to \",Advance_curve!D9,\" RPM\")","v":"Advance curve is freely adjustable from 643 to 5095 RPM"},null,null,null,null,null,"cell B9 in tab \"Advance_curve\""]
[]
["C)",{"$f":"CONCATENATE(\"The \",Advance_curve!C7,\" RPM when the processor swap from [advance_curve] tab to the flat [advance_low_rpm] tab is adjustable by cell M42 in tab [Advance_curve]\")","v":"The 643 RPM when the processor swap from [advance_curve] tab to the flat [advance_low_rpm] tab is adjustable by cell M42 in tab [Advance_curve]"}]
[]
[null,"Eprom values to burn into the microcontroller",null,null,null,null,null,"cells O18 to 035 in tab \"Advance_curve\""]
[]
[null,{"$f":"CONCATENATE(\"No spark when engine goes above \",Advance_curve!D9,\"RPM - Act as absolute rev-limiter\")","v":"No spark when engine goes above 5095RPM - Act as absolute rev-limiter"},null,null,null,null,null,"cell B9 in tab \"Advance_curve\""]
[]
[null,"Optional rev-limiter activated by JP2 jumper",null,null,null,null,null,"cell M30 in tab \"Advance_curve\""]
[]
[null,"ONLY YELLOW CELLS ARE CHANGEABLE"]

{"sheet":"Advance_curve","index":1,"n_rows":335,"n_cols":25,"rows_kept":335,"cut":false,"hidden":false,"merged":[]}
["27/03/2021",null,null,"Version 16F1827 v7.9r25c1",null,null,null,null,null,null,79,25,1]
[null,"Proc:","16F1827"]
[null,"Clock:",16,"MHz",null,"1 i",null,null,null,null,"Step"]
[null,"Fosc/4",{"$f":"C3/4","v":4},"MHz",null,"pickup position",null,"compute (us)",{"$f":"O28","v":26},null,"(us)"]
[null,"TMR1h max",{"$f":"MAX(B173:B335)","v":182},null,null,50,"degrees BTDC",null,null,null,40,{"$f":"IF(MAX(K9:K103)>254,\"Some warning. Increase STEP cell k5 ?\",\"\")","v":""}]
[null,"Frq min",{"$f":"MIN(C174:C335)","v":10.731456043956044},null,null,null,null,"hysteresis",{"$f":"O42*200","v":200}]
[null,"RPM min",{"$f":"MIN(D175:D335)","v":643},null,null,"4 i",null,null,null,null,{"$f":"IF(ISERROR(K9),\"Load DECHEX macro\",\"\")","v":""}]
[null,"TIMER1H count","Frq\n(Hz)","RPM","time for 1° (µs)","Advance (degrees)","Delay\nneeded\n(ms)","Delay\nnedeed\n(µs)","Delay\nto wait\n(µs)","@\nmap","Values for\nthe map"]
["3 g",23,{"$f":"IFERROR(1000000/(B9*256*($N$30/$C$4)),\"\")","v":84.918478260869563},{"$f":"INT(60*C9*$N$25/2*$N$24)","v":5095},{"$f":"((1000*1000*60)/($N$24*D9))/360","v":32.711808963035658},39,{"$f":"(E9*($F$5-F9))/1000","v":0.35982989859339221},{"$f":"E9*($F$5-F9)","v":359.82989859339222},{"$f":"IF($H9>$I$4+$I$6,INT($H9-$I$4-$I$6),\"out of range\")","v":133},0,{"$f":"IFERROR(IF($I9/$K$5>255,255,IF($I9>0.01,INT($I9/$K$5),1)),255)","v":3},{"$f":"IF($I9/$K$5>255,CONCATENATE(\"WARNING: Timing will be more then \",F9,\"°\"),\"\")","v":""},null,null,null,null,null,null,null,null,null,null,null,null,{"$f":"CONCATENATE(K9,\"         ;\",ROUND(D9,0),\"rpm | \",ROUND(F9,1),\"° | \",,ROUND(G9,2),\"ms \")","v":"3         ;5095rpm | 39° | 0,36ms "}]
[{"$f":"IF($B10>255,CONCATENATE(\"ERROR: Timer1H too large\"),\"\")","v":""},{"$f":"IF((B9+1)<(N$44+$B$9),B9+1,\"- End -\")","v":24},{"$f":"IFERROR(1000000/(B10*256*($N$30/$C$4)),\"\")","v":81.380208333333329},{"$f":"INT(60*C10*$N$25/2*$N$24)","v":4882},34.139014065273798,39,0.37552915471801179,375.5291547180118,{"$f":"IF($H10>$I$4+$I$6,INT($H10-$I$4-$I$6),\"out of range\")","v":149},1,3,"",null,null,null,null,null,null,null,null,null,null,null,null,"3         ;4882rpm | 39° | 0,38ms "]
["",25,78.125,{"$f":"INT(60*C11*$N$25/2*$N$24)","v":4687},35.559348552734519,39,0.39115283408007973,391.15283408007974,{"$f":"IF($H11>$I$4+$I$6,INT($H11-$I$4-$I$6),\"out of range\")","v":165},2,4,"",null,null,null,null,null,null,null,null,null,null,null,null,"4         ;4687rpm | 39° | 0,39ms "]
["",26,75.120192307692307,4507,36.979513349604318,39,0.40677464684564751,406.77464684564751,180,3,4,"",null,null,null,null,null,null,null,null,null,null,null,null,"4         ;4507rpm | 39° | 0,41ms "]
["",27,72.337962962962962,4340,38.402457757296467,39,0.42242703533026116,422.42703533026116,196,4,4,"",null,null,null,null,null,null,null,null,null,null,null,null,"4         ;4340rpm | 39° | 0,42ms "]
["",28,69.754464285714292,4185,39.82477100756671,39,0.43807248108323382,438.07248108323381,212,5,5,"",null,null,null,null,null,null,null,null,null,null,null,null,"5         ;4185rpm | 39° | 0,44ms "]
["",29,67.349137931034477,4040,41.254125412541256,39,0.45379537953795379,453.79537953795381,227,6,5,"",null,null,null,null,null,null,null,null,null,null,null,null,"5         ;4040rpm | 39° | 0,45ms "]
["",30,65.104166666666671,3906,42.669397508107181,39,0.46936337258917898,469.36337258917899,243,7,6,"",null,null,null,null,null,null,null,null,null,null,null,null,"6         ;3906rpm | 39° | 0,47ms "]
["",31,63.00403225806452,3780,44.091710758377424,39,0.48500881834215165,485.00881834215164,259,8,6,"",null,null,"EEprom data ð",{"$f":"CONCATENATE(EEPROM16!O1,\" for PIC 16F1827\")","v":"INTEL 16HEX format for PIC 16F1827"},null,null,null,null,null,null,null,null,"6         ;3780rpm | 39° | 0,49ms "]
["",32,61.03515625,3662,45.512470416894232,39,0.50063717458583656,500.63717458583653,274,9,6,"",null,null,null,null,null,null,null,"MCH format",null,null,null,null,"6         ;3662rpm | 39° | 0,5ms "]
["",33,59.185606060606062,3551,46.935135642542008,39,0.51628649206796207,516.28649206796206,290,10,7,"",null,null,null,{"$f":"EEPROM16!O2","v":":020000040000FA"},null,{"$f":"EEPROM16!Q1","v":"RAW format"},null,null,null,null,null,null,"7         ;3551rpm | 39° | 0,52ms "]
["",34,57.444852941176471,3446,48.365254401238154,39,0.53201779841361974,532.01779841361974,306,11,7,"",null,null,null,{"$f":"EEPROM16!O3","v":":020000040001F9"},null,null,null,{"$f":"DEC2HEX(EEPROM16!F$4,2)","v":"03"},null,null,null,null,"7         ;3446rpm | 39° | 0,53ms "]
["",35,55.803571428571431,3348,49.780963759458388,39,0.54759060135404225,547.59060135404229,321,12,8,"",null,null,null,{"$f":"EEPROM16!O4","v":":10E0000003000300040004000400050005000600EE"},null,{"$f":"EEPROM16!Q4","v":"03 03 04 04   04 05 05 06"},null,{"$f":"DEC2HEX(EEPROM16!G$4,2)","v":"03"},null,null,null,null,"8         ;3348rpm | 39° | 0,55ms "]
["",36,54.253472222222221,3255,51.203277009728623,39,0.56323604710701491,563.23604710701488,337,13,8,"",null,"2 i",null,{"$f":"EEPROM16!O5","v":":10E0100006000600070007000800080008000900C5"},null,{"$f":"EEPROM16!Q5","v":"06 06 07 07   08 08 08 09"},null,{"$f":"DEC2HEX(EEPROM16!H$4,2)","v":"04"},null,null,null,null,"8         ;3255rpm | 39° | 0,56ms "]
["",37,52.787162162162161,3167,52.626039364277446,39,0.57888643300705189,578.88643300705189,352,14,8,"",null,null,null,{"$f":"EEPROM16!O6","v":":10E0200009000C000E00100011001300150017006D"},null,{"$f":"EEPROM16!Q6","v":"09 0C 0E 10   11 13 15 17"},null,{"$f":"DEC2HEX(EEPROM16!I$4,2)","v":"04"},null,null,null,null,"8         ;3167rpm | 39° | 0,58ms "]
["",38,51.398026315789473,3083,54.059898367391071,39,0.5946588820413018,594.65888204130181,368,15,9,"","Number of cylinder",1,null,{"$f":"EEPROM16!O7","v":":10E0300018001A001C001E001F00210023002500EC"},null,{"$f":"EEPROM16!Q7","v":"18 1A 1C 1E   1F 21 23 25"},null,{"$f":"DEC2HEX(EEPROM16!J$4,2)","v":"04"},null,null,null,null,"9         ;3083rpm | 39° | 0,59ms "]
["",39,50.080128205128204,3004,55.481580115401691,39,0.61029738126941857,610.29738126941857,384,16,9,"",null,{"$f":"IF(N26=\"4 no wasted spark\",4,2)","v":2},null,{"$f":"EEPROM16!O8","v":":10E04000270028002A002C002E002F00310033006A"},null,{"$f":"EEPROM16!Q8","v":"27 28 2A 2C   2E 2F 31 33"},null,{"$f":"DEC2HEX(EEPROM16!K$4,2)","v":"05"},null,null,null,null,"9         ;3004rpm | 39° | 0,61ms "]
["",40,48.828125,2929,56.902241948332758,37.104527296937398,0.73378130778778883,733.78130778778882,507,17,12,"","Strokes","4 wasted spark",null,{"$f":"EEPROM16!O9","v":":10E050003500360038003A003C003D003F004100EA"},null,{"$f":"EEPROM16!Q9","v":"35 36 38 3A   3C 3D 3F 41"},null,{"$f":"DEC2HEX(EEPROM16!L$4,2)","v":"05"},null,null,null,null,"12         ;2929rpm | 37,1° | 0,73ms "]
["",41,47.637195121951223,2858,58.315838581758804,36.221704394141099,0.80349286248302432,803.49286248302428,577,18,14,"",null,null,null,{"$f":"EEPROM16!O10","v":":10E0600043004500460048004A004C004D004F0068"},null,{"$f":"EEPROM16!Q10","v":"43 45 46 48   4A 4C 4D 4F"},null,{"$f":"DEC2HEX(EEPROM16!M$4,2)","v":"06"},null,null,null,null,"14         ;2858rpm | 36,2° | 0,8ms "]
["",42,46.50297619047619,2790,59.737156511350058,35.377829560585901,0.87348688407491626,873.48688407491625,647,19,16,"","Ignition type","DCCDI",{"$f":"IF(N28=\"ACCDI\",42,26)","v":26},{"$f":"EEPROM16!O11","v":":10E07000510053005400560058005A005C005D00E7"},null,{"$f":"EEPROM16!Q11","v":"51 53 54 56   58 5A 5C 5D"},null,{"$f":"DEC2HEX(EEPROM16!F$5,2)","v":"06"},null,null,null,null,"16         ;2790rpm | 35,4° | 0,87ms "]
["",43,45.421511627906973,2725,61.162079510703357,34.572902796271599,0.94355334579378591,943.55334579378587,717,20,17,"",null,null,null,{"$f":"EEPROM16!O12","v":":10E080005F00610063006400660068006A006C0065"},null,{"$f":"EEPROM16!Q12","v":"5F 61 63 64   66 68 6A 6C"},null,{"$f":"DEC2HEX(EEPROM16!G$5,2)","v":"06"},null,null,null,null,"17         ;2725rpm | 34,6° | 0,94ms "]
["",44,44.389204545454547,2663,62.5860558267618,33.806924101198398,1.0134607522093881,1013.4607522093881,787,21,19,"","prescaler",8,null,{"$f":"EEPROM16!O13","v":":10E090006D006F007200760079007C007F008100C7"},null,{"$f":"EEPROM16!Q13","v":"6D 6F 72 76   79 7C 7F 81"},null,{"$f":"DEC2HEX(EEPROM16!H$5,2)","v":"07"},null,null,null,null,"19         ;2663rpm | 33,8° | 1,01ms "]
["",45,43.402777777777779,2604,64.004096262160786,33.0669107856192,1.0837870720929852,1083.7870720929852,857,22,21,"",null,null,null,{"$f":"EEPROM16!O14","v":":10E0A0003400350036003700380039003A003B00B4"},null,{"$f":"EEPROM16!Q14","v":"34 35 36 37   38 39 3A 3B"},null,{"$f":"DEC2HEX(EEPROM16!I$5,2)","v":"07"},null,null,null,null,"21         ;2604rpm | 33,1° | 1,08ms "]
["",46,42.459239130434781,2547,65.436461196178499,32.365845539280997,1.153916664096257,1153.9166640962571,927,23,23,"","output width",2000,"us",{"$f":"EEPROM16!O15","v":":10E0B0003C003D003E003F003F0040004200490060"},null,{"$f":"EEPROM16!Q15","v":"3C 3D 3E 3F   3F 40 42 49"},null,{"$f":"DEC2HEX(EEPROM16!J$5,2)","v":"08"},null,null,null,null,"23         ;2547rpm | 32,4° | 1,15ms "]
["",47,41.555851063829785,2493,66.853857467575878,31.690745672436801,1.224044279152507,1224.044279152507,998,24,24,"",null,null,null,{"$f":"EEPROM16!O16","v":":10E0C00049004A004B004B004C004D004D004E00F3"},null,{"$f":"EEPROM16!Q16","v":"49 4A 4B 4B   4C 4D 4D 4E"},null,{"$f":"DEC2HEX(EEPROM16!K$5,2)","v":"08"},null,null,null,null,"24         ;2493rpm | 31,7° | 1,22ms "]
["",48,40.690104166666664,2441,68.278028130547597,31.041611185086602,1.2944414048145159,1294.4414048145159,1068,25,26,"","Optional Rev Limit",5095,"RPM",{"$f":"EEPROM16!O17","v":":10E0D0004F004F00500050005100520052005300BA"},null,{"$f":"EEPROM16!Q17","v":"4F 4F 50 50   51 52 52 53"},null,{"$f":"DEC2HEX(EEPROM16!L$5,2)","v":"08"},null,null,null,null,"26         ;2441rpm | 31° | 1,29ms "]
["",49,39.859693877551024,2391,69.705841349505079,30.418442077230399,1.364948969940722,1364.948969940722,1138,26,28,"",null,null,null,{"$f":"EEPROM16!O18","v":":10E0E0005400540055005600560057005700580081"},null,{"$f":"EEPROM16!Q18","v":"54 54 55 56   56 57 57 58"},null,{"$f":"DEC2HEX(EEPROM16!M$5,2)","v":"09"},null,null,null,null,"28         ;2391rpm | 30,4° | 1,36ms "]
["",50,39.0625,2343,71.133873950775367,29.821238348868199,1.4353934877743493,1435.3934877743493,1209,27,30,"","Nbr of teeth on rotor",1,{"$f":"IF(N36=2,1,0)","v":0},{"$f":"EEPROM16!O19","v":":10E0F000590059005A005B005B005C005D005D0048"},null,{"$f":"EEPROM16!Q19","v":"59 59 5A 5B   5B 5C 5D 5D"},null,{"$f":"DEC2HEX(EEPROM16!F$6,2)","v":"09"},null,null,null,null,"30         ;2343rpm | 29,8° | 1,44ms "]
["",51,38.296568627450981,2297,72.558409519663329,29.25,1.5055869975330141,1505.586997533014,1279,28,31,"",null,null,null,{"$f":"EEPROM16!O20","v":":10E100005E005F005F00600060006100620062000E"},null,{"$f":"EEPROM16!Q20","v":"5E 5F 5F 60   60 61 62 62"},null,{"$f":"DEC2HEX(EEPROM16!G$6,2)","v":"0C"},null,null,null,null,"31         ;2297rpm | 29,3° | 1,51ms "]
["",52,37.560096153846153,2253,73.975440153868917,28.704727030625801,1.5753271911062434,1575.3271911062434,1349,29,33,"","Led blink at startup","yes",{"$f":"IF(N38=\"yes\",1,0)","v":1},{"$f":"EEPROM16!O21","v":":10E1100063006400640065006600660067006800D4"},null,{"$f":"EEPROM16!Q21","v":"63 64 64 65   66 66 67 68"},null,{"$f":"DEC2HEX(EEPROM16!H$6,2)","v":"0E"},null,null,null,null,"33         ;2253rpm | 28,7° | 1,58ms "]
["",53,36.851415094339622,2211,75.38067239559777,28.172436750998699,1.6453763944671569,1645.3763944671568,1419,30,35,"",null,null,null,{"$f":"EEPROM16!O22","v":":10E120006800690069006A006B006B006C006D009C"},null,{"$f":"EEPROM16!Q22","v":"68 69 69 6A   6B 6B 6C 6D"},null,{"$f":"DEC2HEX(EEPROM16!I$6,2)","v":"10"},null,null,null,null,"35         ;2211rpm | 28,2° | 1,65ms "]
["",54,36.168981481481481,2170,76.804915514592935,27.6531291611185,1.7163495267958142,1716.3495267958142,1490,31,37,"","First measure","yes",{"$f":"IF(N40=\"yes\",1,0)","v":1},{"$f":"EEPROM16!O23","v":":10E130006D006E006F006F00700070007100720063"},null,{"$f":"EEPROM16!Q23","v":"6D 6E 6F 6F   70 70 71 72"},null,{"$f":"DEC2HEX(EEPROM16!J$6,2)","v":"11"},null,null,null,null,"37         ;2170rpm | 27,7° | 1,72ms "]
["",55,35.511363636363633,2130,{"$f":"((1000*1000*60)/($N$24*D41))/360","v":78.247261345852891},27.1597869507324,{"$f":"(E41*($F$5-F41))/1000","v":1.7871841196610014},{"$f":"E41*($F$5-F41)","v":1787.1841196610014},1561,32,39,{"$f":"IF($I41/$K$5>255,CONCATENATE(\"WARNING: Timing will be more then \",F41,\"°\"),\"\")","v":""},null,null,null,{"$f":"EEPROM16!O24","v":":10E1400000000000000000000000000000000000CF"},null,{"$f":"EEPROM16!Q24","v":"00 00 00 00   00 00 00 00"},null,{"$f":"DEC2HEX(EEPROM16!K$6,2)","v":"13"},null,null,null,null,{"$f":"CONCATENATE(K41,\"         ;\",ROUND(D41,0),\"rpm | \",ROUND(F41,1),\"° | \",,ROUND(G41,2),\"ms \")","v":"39         ;2130rpm | 27,2° | 1,79ms "}]
[{"$f":"IF($B42>255,CONCATENATE(\"ERROR: Timer1H too large\"),\"\")","v":""},{"$f":"IF((B41+1)<(N$44+$B$9),B41+1,\"- End -\")","v":56},34.877232142857146,2092,79.668578712555771,26.679427430093199,1.857916871407489,1857.916871407489,1631,33,40,"","Noise Filtering","yes",{"$f":"IF(N42=\"yes\",1,0)","v":1},{"$f":"EEPROM16!O25","v":":10E1500000000000000000000000000000000000BF"},null,{"$f":"EEPROM16!Q25","v":"00 00 00 00   00 00 00 00"},null,{"$f":"DEC2HEX(EEPROM16!L$6,2)","v":"15"},null,null,null,null,"40         ;2092rpm | 26,7° | 1,86ms "]
["",57,34.265350877192979,2055,81.103000811030014,26.225033288948101,1.9282211444486539,1928.2211444486538,1702,34,42,"",null,null,null,{"$f":"EEPROM16!O26","v":":10E1600000000000000000000000000000000000AF"},null,{"$f":"EEPROM16!Q26","v":"00 00 00 00   00 00 00 00"},null,{"$f":"DEC2HEX(EEPROM16!M$6,2)","v":"17"},null,null,null,null,"42         ;2055rpm | 26,2° | 1,93ms "]
["",58,33.674568965517238,2020,82.508250825082513,25.783621837549902,1.9980510035024837,1998.0510035024836,1772,35,44,"","Number of lines",160,null,{"$f":"EEPROM16!O27","v":":10E17000000000000000000000000000000000009F"},null,{"$f":"EEPROM16!Q27","v":"00 00 00 00   00 00 00 00"},null,{"$f":"DEC2HEX(EEPROM16!F7,2)","v":"18"},null,null,null,null,"44         ;2020rpm | 25,8° | 2ms "]
["",59,33.103813559322035,1986,83.920778784827121,25.3551930758988,2.0682113900722725,2068.2113900722725,1842,36,46,"","5 h",null,null,{"$f":"EEPROM16!O28","v":":10E18000000000000000000000000000000000008F"},null,{"$f":"EEPROM16!Q28","v":"00 00 00 00   00 00 00 00"},null,{"$f":"DEC2HEX(EEPROM16!G7,2)","v":"1A"},null,null,null,null,"46         ;1986rpm | 25,4° | 2,07ms "]
["",60,32.552083333333336,1953,85.338795016214362,24.9397470039947,2.138611793480568,2138.6117934805679,1912,37,47,"",null,null,null,{"$f":"EEPROM16!O29","v":":10E19000000000000000000000000000000000007F"},null,{"$f":"EEPROM16!Q29","v":"00 00 00 00   00 00 00 00"},null,{"$f":"DEC2HEX(EEPROM16!H7,2)","v":"1C"},null,null,null,null,"47         ;1953rpm | 24,9° | 2,14ms "]
["",61,32.018442622950822,1921,86.760367863959743,24.537283621837499,2.209154639785051,2209.1546397850511,1983,38,49,"",null,null,null,{"$f":"EEPROM16!O30","v":":10E1A000000000000000000000000000000000006F"},null,{"$f":"EEPROM16!Q30","v":"00 00 00 00   00 00 00 00"},null,{"$f":"DEC2HEX(EEPROM16!I7,2)","v":"1E"},null,null,null,null,"49         ;1921rpm | 24,5° | 2,21ms "]
["",62,31.50201612903226,1890,88.183421516754848,24.147802929427399,2.2797351914085184,2279.7351914085184,2053,39,51,"",null,null,null,{"$f":"EEPROM16!O31","v":":10E1B000000000000000000000000000000000005F"},null,{"$f":"EEPROM16!Q31","v":"00 00 00 00   00 00 00 00"},null,{"$f":"DEC2HEX(EEPROM16!J7,2)","v":"1F"},null,null,null,null,"51         ;1890rpm | 24,1° | 2,28ms "]
["",63,31.001984126984127,1860,89.605734767025098,23.771304926764302,2.3502414940175358,2350.2414940175358,2124,40,53,"",null,null,null,{"$f":"EEPROM16!O32","v":":10E1C000000000000000000000000000000000004F"},null,{"$f":"EEPROM16!Q32","v":"00 00 00 00   00 00 00 00"},null,{"$f":"DEC2HEX(EEPROM16!K7,2)","v":"21"},null,null,null,null,"53         ;1860rpm | 23,8° | 2,35ms "]
["",64,30.517578125,1831,91.024940833788463,23.3948069241012,2.4217361256052068,2421.7361256052068,2195,41,54,"",null,null,null,{"$f":"EEPROM16!O33","v":":10E1D0004F001900010000000000000000000000D6"},null,{"$f":"EEPROM16!Q33","v":"4F 19 01 00   00 00 00 00"},null,{"$f":"DEC2HEX(EEPROM16!L7,2)","v":"23"},null,null,null,null,"54         ;1831rpm | 23,4° | 2,42ms "]
["",65,30.048076923076923,1802,92.489826119126903,23.044274300932098,2.4931303828216707,2493.1303828216705,2267,42,56,"",null,null,null,{"$f":"EEPROM16!O34","v":":10E1E000A000000032000100C80001000100000092"},null,{"$f":"EEPROM16!Q34","v":"A0 00 32 01   C8 01 01 00"},null,{"$f":"DEC2HEX(EEPROM16!M7,2)","v":"25"},null,null,null,null,"56         ;1802rpm | 23° | 2,49ms "]
["",66,29.592803030303031,1775,93.896713615023472,22.706724367509999,2.5627488856798122,2562.7488856798122,2336,43,58,"",null,null,null,{"$f":"EEPROM16!O35","v":":10E1F0001A00170004000800000028001700B600ED"},null,{"$f":"EEPROM16!Q35","v":"1A 17 04 08   00 28 17 B6"},null,{"$f":"DEC2HEX(EEPROM16!F8,2)","v":"27"},null,null,null,null,"58         ;1775rpm | 22,7° | 2,56ms "]
["",67,29.151119402985074,1749,95.292548122736804,22.369174434087899,2.6330117749106252,2633.0117749106253,2407,44,60,"",null,null,null,{"$f":"EEPROM16!O36","v":":00000001FF"},null,null,null,{"$f":"DEC2HEX(EEPROM16!G8,2)","v":"28"},null,null,null,null,"60         ;1749rpm | 22,4° | 2,63ms "]
["",68,28.722426470588236,1723,96.730508802476308,22.044607190412801,2.7041393702444574,2704.1393702444575,2478,45,61,"",null,null,null,null,null,null,null,{"$f":"DEC2HEX(EEPROM16!H8,2)","v":"2A"},null,null,null,null,"61         ;1723rpm | 22° | 2,7ms "]
["",69,28.306159420289855,1698,98.154691794267762,21.733022636484701,2.7745364510713877,2774.5364510713875,2548,46,63,"",null,null,null,null,null,null,null,{"$f":"DEC2HEX(EEPROM16!I8,2)","v":"2C"},null,null,null,null,"63         ;1698rpm | 21,7° | 2,77ms "]
["",70,27.901785714285715,1674,99.561927518916775,21.421438082556602,2.8453367102193745,2845.3367102193747,2619,47,65,"",null,null,null,null,null,null,null,{"$f":"DEC2HEX(EEPROM16!J8,2)","v":"2E"},null,null,null,null,"65         ;1674rpm | 21,4° | 2,85ms "]
["",71,27.508802816901408,1650,101.010101010101,21.1228362183755,2.9168852304671207,2916.8852304671209,2690,48,67,"",null,null,null,null,null,null,null,{"$f":"DEC2HEX(EEPROM16!K8,2)","v":"2F"},null,null,null,null,"67         ;1650rpm | 21,1° | 2,92ms "]
["",72,27.126736111111111,1627,102.43802499487811,20.837217043941401,2.9873778893729357,2987.3778893729359,2761,49,69,"",null,null,null,null,null,null,null,{"$f":"DEC2HEX(EEPROM16!L8,2)","v":"31"},null,null,null,null,"69         ;1627rpm | 20,8° | 2,99ms "]
["",73,26.75513698630137,1605,103.84215991692628,20.551597869507301,3.0579856833325754,3057.9856833325753,2831,50,70,"",null,null,null,null,null,null,"x",{"$f":"DEC2HEX(EEPROM16!M8,2)","v":"33"},null,null,null,null,"70         ;1605rpm | 20,6° | 3,06ms "]
["",74,26.393581081081081,1583,105.28532322594229,20.278961384820199,3.1291891572099177,3129.1891572099175,2903,51,72,"",null,null,null,null,null,null,null,{"$f":"DEC2HEX(EEPROM16!F9,2)","v":"35"},null,null,null,null,"72         ;1583rpm | 20,3° | 3,13ms "]
["",75,26.041666666666668,1562,106.70081092616304,20.006324900133201,3.2003494558116516,3200.3494558116518,2974,52,74,"",null,null,null,null,null,null,null,{"$f":"DEC2HEX(EEPROM16!G9,2)","v":"36"},null,null,null,null,"74         ;1562rpm | 20° | 3,2ms "]
["",76,25.699013157894736,1541,108.15487778498809,19.746671105193101,3.2720450892068889,3272.0450892068889,3046,53,76,"",null,null,null,null,null,null,null,{"$f":"DEC2HEX(EEPROM16!H9,2)","v":"38"},null,null,null,null,"76         ;1541rpm | 19,7° | 3,27ms "]
["",77,25.365259740259742,1521,109.57703265395574,19.5,3.34209949594565,3342.0994959456502,3116,54,77,"",null,null,null,null,null,null,null,{"$f":"DEC2HEX(EEPROM16!I9,2)","v":"3A"},null,null,null,null,"77         ;1521rpm | 19,5° | 3,34ms "]
["",78,25.040064102564102,1502,110.96316023080338,19.253328894806899,3.4117477924093547,3411.7477924093546,3185,55,79,"",null,null,null,null,null,null,null,{"$f":"DEC2HEX(EEPROM16!J9,2)","v":"3C"},null,null,null,null,"79         ;1502rpm | 19,3° | 3,41ms "]
["",79,24.723101265822784,1483,112.38480557428635,19.006657789613801,3.4831807384115749,3483.180738411575,3257,56,81,"",null,null,null,null,null,null,null,{"$f":"DEC2HEX(EEPROM16!K9,2)","v":"3D"},null,null,null,null,"81         ;1483rpm | 19° | 3,48ms "]
["",80,24.4140625,1464,113.84335154826957,18.772969374167801,3.5549898253451953,3554.9898253451952,3328,57,83,"",null,null,null,null,null,null,null,{"$f":"DEC2HEX(EEPROM16!L9,2)","v":"3F"},null,null,null,null,"83         ;1464rpm | 18,8° | 3,55ms "]
["",81,24.112654320987655,1446,115.2604887044721,18.552263648468699,3.6246814605268902,3624.6814605268901,3398,58,84,"",null,null,null,null,null,null,"x",{"$f":"DEC2HEX(EEPROM16!M9,2)","v":"41"},null,null,null,null,"84         ;1446rpm | 18,6° | 3,62ms "]
["",82,23.818597560975611,1429,116.63167716351761,18.318575233022599,3.695057705502379,3695.0577055023791,3469,59,86,"",null,null,null,null,null,null,null,{"$f":"DEC2HEX(EEPROM16!F10,2)","v":"43"},null,null,null,null,"86         ;1429rpm | 18,3° | 3,7ms "]
["",83,23.531626506024097,1411,118.11953697141507,18.110852197070599,3.7667313728950389,3766.7313728950389,3540,60,88,"",null,null,null,null,null,null,null,{"$f":"DEC2HEX(EEPROM16!G10,2)","v":"45"},null,null,null,null,"88         ;1411rpm | 18,1° | 3,77ms "]
["",84,23.251488095238095,1395,119.47431302270012,17.890146471371501,3.836302691592413,3836.3026915924129,3610,61,90,"",null,null,null,null,null,null,null,{"$f":"DEC2HEX(EEPROM16!H10,2)","v":"46"},null,null,null,null,"90         ;1395rpm | 17,9° | 3,84ms "]
["",85,22.977941176470587,1378,120.94823415578134,17.682423435419398,3.9087538176802865,3908.7538176802864,3682,62,92,"",null,null,null,null,null,null,null,{"$f":"DEC2HEX(EEPROM16!I10,2)","v":"48"},null,null,null,null,"92         ;1378rpm | 17,7° | 3,91ms "]
["",86,22.710755813953487,1362,122.36906510034264,17.474700399467402,3.9800905042257217,3980.0905042257218,3754,63,93,"",null,null,null,null,null,null,null,{"$f":"DEC2HEX(EEPROM16!J10,2)","v":"4A"},null,null,null,null,"93         ;1362rpm | 17,5° | 3,98ms "]
["",87,22.449712643678161,1346,{"$f":"((1000*1000*60)/($N$24*D73))/360","v":123.82367508667656},17.2799600532623,{"$f":"(E73*($F$5-F73))/1000","v":4.0515155951879267},{"$f":"E73*($F$5-F73)","v":4051.5155951879269},3825,64,{"$f":"IFERROR(IF($I73/$K$5>255,255,IF($I73>0.01,INT($I73/$K$5),1)),255)","v":95},{"$f":"IF($I73/$K$5>255,CONCATENATE(\"WARNING: Timing will be more then \",F73,\"°\"),\"\")","v":""},null,null,null,null,null,null,null,{"$f":"DEC2HEX(EEPROM16!K10,2)","v":"4C"},null,null,null,null,{"$f":"CONCATENATE(K73,\"         ;\",ROUND(D73,0),\"rpm | \",ROUND(F73,1),\"° | \",,ROUND(G73,2),\"ms \")","v":"95         ;1346rpm | 17,3° | 4,05ms "}]
[{"$f":"IF($B74>255,CONCATENATE(\"ERROR: Timer1H too large\"),\"\")","v":""},{"$f":"IF((B73+1)<(N$44+$B$9),B73+1,\"- End -\")","v":88},{"$f":"IFERROR(1000000/(B74*256*($N$30/$C$4)),\"\")","v":22.194602272727273},1331,125.21913348359628,17.085219707057298,4.1215602670852372,4121.5602670852368,3895,65,97,"",null,null,null,null,null,null,null,{"$f":"DEC2HEX(EEPROM16!L10,2)","v":"4D"},null,null,null,null,"97         ;1331rpm | 17,1° | 4,12ms "]
["",89,21.945224719101123,{"$f":"INT(60*C75*$N$25/2*$N$24)","v":1316},126.64640324214793,16.903462050599199,4.1915574910588651,4191.5574910588648,{"$f":"IF($H75>$I$4+$I$6,INT($H75-$I$4-$I$6),\"out of range\")","v":3965},66,99,"",null,null,null,null,null,null,"x",{"$f":"DEC2HEX(EEPROM16!M10,2)","v":"4F"},null,null,null,null,"99         ;1316rpm | 16,9° | 4,19ms "]
["",90,21.701388888888889,1302,128.00819252432157,16.708721704394101,4.2615563614446881,4261.5563614446883,4035,67,100,"",null,null,null,null,null,null,null,{"$f":"DEC2HEX(EEPROM16!F11,2)","v":"51"},null,null,null,null,"100         ;1302rpm | 16,7° | 4,26ms "]
["",91,21.462912087912088,1287,129.5001295001295,16.526964047936101,4.3347624905547653,4334.7624905547655,4108,68,102,"",null,null,null,null,null,null,null,{"$f":"DEC2HEX(EEPROM16!G11,2)","v":"53"},null,null,null,null,"102         ;1287rpm | 16,5° | 4,33ms "]
["",92,21.229619565217391,1273,130.92432573972243,16.358189081224999,4.4045314112038483,4404.5314112038486,4178,69,104,"",null,null,null,null,null,null,null,{"$f":"DEC2HEX(EEPROM16!H11,2)","v":"54"},null,null,null,null,"104         ;1273rpm | 16,4° | 4,4ms "]
["",93,21.001344086021504,1260,132.27513227513228,16.176431424766999,4.4740170073059522,4474.0170073059526,4248,70,106,"",null,null,null,null,null,null,null,{"$f":"DEC2HEX(EEPROM16!I11,2)","v":"56"},null,null,null,null,"106         ;1260rpm | 16,2° | 4,47ms "]
["",94,20.777925531914892,1246,133.76136971642589,16.007656458055902,4.5468624320417454,4546.8624320417457,4320,71,108,"",null,null,null,null,null,null,null,{"$f":"DEC2HEX(EEPROM16!J11,2)","v":"58"},null,null,null,null,"108         ;1246rpm | 16° | 4,55ms "]
["",95,20.559210526315791,1233,135.17166801838334,15.8388814913449,4.6176153701885774,4617.6153701885778,4391,72,109,"",null,null,null,null,null,null,null,{"$f":"DEC2HEX(EEPROM16!K11,2)","v":"5A"},null,null,null,null,"109         ;1233rpm | 15,8° | 4,62ms "]
["",96,20.345052083333332,1220,136.61202185792351,15.6830892143808,4.6881025663414215,4688.1025663414212,4462,73,111,"",null,null,null,null,null,null,null,{"$f":"DEC2HEX(EEPROM16!L11,2)","v":"5C"},null,null,null,null,"111         ;1220rpm | 15,7° | 4,69ms "]
["",97,20.135309278350515,1208,137.9690949227373,15.2,4.8013245033112577,4801.324503311258,4575,74,114,"",null,null,null,null,null,null,"x",{"$f":"DEC2HEX(EEPROM16!M11,2)","v":"5D"},null,null,null,null,"114         ;1208rpm | 15,2° | 4,8ms "]
["",98,19.929846938775512,1195,139.47001394700141,14.4,4.9651324965132497,4965.1324965132499,4739,75,118,"",null,null,null,null,null,null,null,{"$f":"DEC2HEX(EEPROM16!F12,2)","v":"5F"},null,null,null,null,"118         ;1195rpm | 14,4° | 4,97ms "]
["",99,19.728535353535353,1183,140.88475626937165,13.8,5.1000281769512537,5100.028176951254,4874,76,121,"",null,null,null,null,null,null,null,{"$f":"DEC2HEX(EEPROM16!G12,2)","v":"61"},null,null,null,null,"121         ;1183rpm | 13,8° | 5,1ms "]
["",100,19.53125,1171,142.32849416453172,13.4,5.2092228864218617,5209.2228864218614,4983,77,124,"",null,null,null,null,null,null,null,{"$f":"DEC2HEX(EEPROM16!H12,2)","v":"63"},null,null,null,null,"124         ;1171rpm | 13,4° | 5,21ms "]
["",101,19.337871287128714,1160,143.67816091954023,13,5.3160919540229887,5316.0919540229888,5090,78,127,"",null,null,null,null,null,null,null,{"$f":"DEC2HEX(EEPROM16!I12,2)","v":"64"},null,null,null,null,"127         ;1160rpm | 13° | 5,32ms "]
["",102,19.14828431372549,1148,145.18002322880372,12.8,5.4006968641114987,5400.6968641114991,5174,79,129,"",null,null,null,null,null,null,null,{"$f":"DEC2HEX(EEPROM16!J12,2)","v":"66"},null,null,null,null,"129         ;1148rpm | 12,8° | 5,4ms "]
["",103,18.962378640776699,1137,146.5845793022574,12.5,5.4969217238346531,5496.9217238346528,5270,0,{"$f":"IFERROR(IF($I89/100>255,255,IF($I89>0.01,INT($I89/100),1)),255)","v":52},{"$f":"IF($I89/100>255,CONCATENATE(\"WARNING: Timing will be more then \",F89,\"°\"),\"\")","v":""},null,null,null,null,null,null,null,{"$f":"DEC2HEX(EEPROM16!K12,2)","v":"68"},null,null,null,null,"52         ;1137rpm | 12,5° | 5,5ms "]
["",104,18.780048076923077,1126,148.01657785671995,12.2,5.5950266429840143,5595.026642984014,5369,1,{"$f":"IFERROR(IF($I90/100>255,255,IF($I90>0.01,INT($I90/100),1)),255)","v":53},{"$f":"IF($I90/100>255,CONCATENATE(\"WARNING: Timing will be more then \",F90,\"°\"),\"\")","v":""},null,null,null,null,null,null,null,{"$f":"DEC2HEX(EEPROM16!L12,2)","v":"6A"},null,null,null,null,"53         ;1126rpm | 12,2° | 5,6ms "]
["",105,18.601190476190474,1116,149.34289127837513,11.8,5.7048984468339308,5704.8984468339304,5478,2,{"$f":"IFERROR(IF($I91/100>255,255,IF($I91>0.01,INT($I91/100),1)),255)","v":54},"",null,null,null,null,null,null,"x",{"$f":"DEC2HEX(EEPROM16!M12,2)","v":"6C"},null,null,null,null,"54         ;1116rpm | 11,8° | 5,7ms "]
["",106,18.425707547169811,1105,150.82956259426848,11.6,5.7918552036199102,5791.8552036199098,5565,3,55,"",null,null,null,null,null,null,null,{"$f":"DEC2HEX(EEPROM16!F13,2)","v":"6D"},null,null,null,null,"55         ;1105rpm | 11,6° | 5,79ms "]
["",107,18.253504672897197,1095,152.20700152207002,11.4,5.8751902587519025,5875.1902587519025,5649,4,56,"",null,null,null,null,null,null,null,{"$f":"DEC2HEX(EEPROM16!G13,2)","v":"6F"},null,null,null,null,"56         ;1095rpm | 11,4° | 5,88ms "]
["",108,18.08449074074074,1085,153.60983102918587,11.2,5.9600614439324113,5960.0614439324117,5734,5,57,"",null,null,null,null,null,null,null,{"$f":"DEC2HEX(EEPROM16!H13,2)","v":"72"},null,null,null,null,"57         ;1085rpm | 11,2° | 5,96ms "]
["",109,17.918577981651374,1075,155.03875968992247,10.9,6.0620155038759682,6062.0155038759685,5836,6,58,"",null,null,null,null,null,null,null,{"$f":"DEC2HEX(EEPROM16!I13,2)","v":"76"},null,null,null,null,"58         ;1075rpm | 10,9° | 6,06ms "]
["",110,17.755681818181817,1065,156.49452269170578,10.6,6.1658841940532074,6165.8841940532075,5939,7,59,"",null,null,null,null,null,null,null,{"$f":"DEC2HEX(EEPROM16!J13,2)","v":"79"},null,null,null,null,"59         ;1065rpm | 10,6° | 6,17ms "]
["",111,17.59572072072072,1055,157.9778830963665,10.3,6.2717219589257498,6271.7219589257502,6045,8,60,"",null,null,null,null,null,null,null,{"$f":"DEC2HEX(EEPROM16!K13,2)","v":"7C"},null,null,null,null,"60         ;1055rpm | 10,3° | 6,27ms "]
["",112,17.438616071428573,1046,159.33715742511154,10,6.3734862970044617,6373.4862970044614,6147,9,61,"",null,null,null,null,null,null,null,{"$f":"DEC2HEX(EEPROM16!L13,2)","v":"7F"},null,null,null,null,"61         ;1046rpm | 10° | 6,37ms "]
["",113,17.284292035398231,1037,160.72002571520412,9.8000000000000007,6.460945033751206,6460.9450337512062,6234,10,62,"",null,null,null,null,null,null,"x",{"$f":"DEC2HEX(EEPROM16!M13,2)","v":"81"},null,null,null,null,"62         ;1037rpm | 9,8° | 6,46ms "]
["",114,17.13267543859649,1027,162.28497241155469,9.6999999999999993,6.5400843881856536,6540.0843881856536,6314,11,63,"",null,null,null,null,null,null,null,{"$f":"DEC2HEX(EEPROM16!F14,2)","v":"34"},null,null,null,null,"63         ;1027rpm | 9,7° | 6,54ms "]
["",115,16.983695652173914,1019,163.55904481517828,9.6,6.6077854105332028,6607.7854105332026,6381,12,63,"",null,null,null,null,null,null,null,{"$f":"DEC2HEX(EEPROM16!G14,2)","v":"35"},null,null,null,null,"63         ;1019rpm | 9,6° | 6,61ms "]
["",116,16.837284482758619,1010,165.01650165016503,9.3000000000000007,6.7161716171617174,6716.1716171617172,6490,13,64,"",null,null,null,null,null,null,null,{"$f":"DEC2HEX(EEPROM16!H14,2)","v":"36"},null,null,null,null,"64         ;1010rpm | 9,3° | 6,72ms "]
["",117,16.693376068376068,1001,166.5001665001665,9,6.8265068265068267,6826.5068265068267,6600,14,66,"",null,null,null,null,null,null,null,{"$f":"DEC2HEX(EEPROM16!I14,2)","v":"37"},null,null,null,null,"66         ;1001rpm | 9° | 6,83ms "]
["",118,16.551906779661017,993,167.84155756965424,5,{"$f":"(E104*($F$5-F104))/1000","v":7.5528700906344408},{"$f":"E104*($F$5-F104)","v":7552.8700906344411},7326,15,73,"",null,null,null,null,null,null,null,{"$f":"DEC2HEX(EEPROM16!J14,2)","v":"38"},null,null,null,null,"73         ;993rpm | 5° | 7,55ms "]
["",119,16.412815126050422,984,169.37669376693768,5,7.6219512195121952,7621.9512195121952,7395,16,73,"",null,null,null,null,null,null,null,{"$f":"DEC2HEX(EEPROM16!K14,2)","v":"39"}]
["",{"$f":"IF((B105+1)<(N$44+$B$9),B105+1,\"- End -\")","v":120},16.276041666666668,976,170.76502732240439,5,7.6844262295081984,7684.426229508198,7458,17,74,"",null,null,null,null,null,null,null,{"$f":"DEC2HEX(EEPROM16!L14,2)","v":"3A"}]
["",121,16.141528925619834,968,172.1763085399449,5,7.7479338842975203,7747.9338842975203,7521,18,75,"",null,null,null,null,null,null,"x",{"$f":"DEC2HEX(EEPROM16!M14,2)","v":"3B"}]
["",122,16.009221311475411,960,173.61111111111111,5,7.8125,7812.5,7586,19,75,"",null,null,null,null,null,null,null,{"$f":"DEC2HEX(EEPROM16!F15,2)","v":"3C"}]
["",123,15.879065040650406,952,175.07002801120447,5,7.8781512605042003,7878.1512605042008,7652,20,76,"",null,null,null,null,null,null,null,{"$f":"DEC2HEX(EEPROM16!G15,2)","v":"3D"}]
["",124,15.75100806451613,945,176.3668430335097,5,7.9365079365079367,7936.5079365079364,7710,21,77,"",null,null,null,null,null,null,null,{"$f":"DEC2HEX(EEPROM16!H15,2)","v":"3E"}]
["",125,15.625,937,177.87264318747776,5,8.0042689434364984,8004.2689434364993,7778,22,77,"",null,null,null,null,null,null,null,{"$f":"DEC2HEX(EEPROM16!I15,2)","v":"3F"}]
["",126,15.500992063492063,930,179.2114695340502,5,8.064516129032258,8064.5161290322585,7838,23,78,"",null,null,null,null,null,null,null,{"$f":"DEC2HEX(EEPROM16!J15,2)","v":"3F"}]
["",127,15.378937007874017,922,180.76644974692698,5,8.1344902386117131,8134.4902386117137,7908,24,79,"",null,null,null,null,null,null,null,{"$f":"DEC2HEX(EEPROM16!K15,2)","v":"40"}]
["",128,15.2587890625,915,182.14936247723134,5,8.1967213114754109,8196.7213114754104,7970,25,79,"",null,null,null,null,null,null,null,{"$f":"DEC2HEX(EEPROM16!L15,2)","v":"42"}]
["",129,15.140503875968992,908,183.55359765051395,5,8.2599118942731273,8259.9118942731275,8033,26,80,"",null,null,null,null,null,null,"x",{"$f":"DEC2HEX(EEPROM16!M15,2)","v":"49"}]
["",130,15.024038461538462,901,184.97965223825381,5,8.3240843507214208,8324.0843507214213,8098,27,80,"",null,null,null,null,null,null,null,{"$f":"DEC2HEX(EEPROM16!F16,2)","v":"49"}]
["",131,14.909351145038167,894,186.42803877703207,5,8.3892617449664435,8389.2617449664431,8163,28,81,"",null,null,null,null,null,null,null,{"$f":"DEC2HEX(EEPROM16!G16,2)","v":"4A"}]
["",132,14.796401515151516,887,187.89928598271325,5,8.4554678692220975,8455.4678692220969,8229,29,82,"",null,null,null,null,null,null,null,{"$f":"DEC2HEX(EEPROM16!H16,2)","v":"4B"}]
["",133,14.68515037593985,881,189.17896329928112,5,8.5130533484676505,8513.0533484676507,8287,30,82,"",null,null,null,null,null,null,null,{"$f":"DEC2HEX(EEPROM16!I16,2)","v":"4B"}]
["",134,14.575559701492537,874,190.69412662090008,5,8.5812356979405031,8581.2356979405031,8355,31,83,"",null,null,null,null,null,null,null,{"$f":"DEC2HEX(EEPROM16!J16,2)","v":"4C"}]
["",135,14.467592592592593,868,192.01228878648232,5,8.6405529953917046,8640.5529953917048,8414,32,84,"",null,null,null,null,null,null,null,{"$f":"DEC2HEX(EEPROM16!K16,2)","v":"4D"}]
["",136,14.361213235294118,861,193.57336430507164,5,8.7108013937282234,8710.801393728223,8484,33,84,"",null,null,null,null,null,null,null,{"$f":"DEC2HEX(EEPROM16!L16,2)","v":"4D"}]
["",137,14.256386861313869,855,194.93177387914227,5,8.7719298245614024,8771.9298245614027,8545,34,85,"",null,null,null,null,null,null,"x",{"$f":"DEC2HEX(EEPROM16!M16,2)","v":"4E"}]
["",138,14.153079710144928,849,196.30938358853552,5,8.8339222614840978,8833.9222614840983,8607,35,86,"",null,null,null,null,null,null,null,{"$f":"DEC2HEX(EEPROM16!F17,2)","v":"4F"}]
["",139,14.051258992805755,843,197.70660340055358,5,8.8967971530249113,8896.7971530249106,8670,36,86,"",null,null,null,null,null,null,null,{"$f":"DEC2HEX(EEPROM16!G17,2)","v":"4F"}]
["",140,13.950892857142858,837,199.12385503783355,5,8.9605734767025105,8960.5734767025097,8734,37,87,"",null,null,null,null,null,null,null,{"$f":"DEC2HEX(EEPROM16!H17,2)","v":"50"}]
["",141,13.851950354609929,831,200.56157240272765,5,9.025270758122744,9025.2707581227442,8799,38,87,"",null,null,null,null,null,null,null,{"$f":"DEC2HEX(EEPROM16!I17,2)","v":"50"}]
["",142,13.754401408450704,825,202.02020202020199,5,{"$f":"(E128*($F$5-F128))/1000","v":9.0909090909090899},{"$f":"E128*($F$5-F128)","v":9090.9090909090901},8864,39,88,"",null,null,null,null,null,null,null,{"$f":"DEC2HEX(EEPROM16!J17,2)","v":"51"}]
["",143,13.658216783216783,819,203.5002035002035,5,9.1575091575091569,9157.5091575091574,8931,40,89,"",null,null,null,null,null,null,null,{"$f":"DEC2HEX(EEPROM16!K17,2)","v":"52"}]
["",144,13.563368055555555,813,205.00205002050021,5,9.2250922509225095,9225.0922509225093,8999,41,89,"",null,null,null,null,null,null,null,{"$f":"DEC2HEX(EEPROM16!L17,2)","v":"52"}]
["",145,13.469827586206897,808,206.27062706270627,5,9.282178217821782,9282.1782178217818,9056,42,90,"",null,null,null,null,null,null,"x",{"$f":"DEC2HEX(EEPROM16!M17,2)","v":"53"}]
["",146,13.377568493150685,802,207.81379883624274,5,9.3516209476309236,9351.6209476309232,9125,43,91,"",null,null,null,null,null,null,null,{"$f":"DEC2HEX(EEPROM16!F18,2)","v":"54"}]
["",147,13.286564625850341,797,209.11752404851529,5,9.4102885821831883,9410.2885821831878,9184,44,91,"",null,null,null,null,null,null,null,{"$f":"DEC2HEX(EEPROM16!G18,2)","v":"54"}]
["",148,13.19679054054054,791,210.70375052675939,5,9.4816687737041718,9481.6687737041721,9255,45,92,"",null,null,null,null,null,null,null,{"$f":"DEC2HEX(EEPROM16!H18,2)","v":"55"}]
["",149,13.108221476510067,786,212.04410517387615,5,9.5419847328244263,9541.9847328244268,9315,46,93,"",null,null,null,null,null,null,null,{"$f":"DEC2HEX(EEPROM16!I18,2)","v":"56"}]
["",150,13.020833333333334,781,213.40162185232609,5,9.6030729833546733,9603.0729833546739,9377,47,93,"",null,null,null,null,null,null,null,{"$f":"DEC2HEX(EEPROM16!J18,2)","v":"56"}]
["",151,12.934602649006623,776,{"$f":"((1000*1000*60)/($N$24*D137))/360","v":214.77663230240549},5,9.6649484536082468,9664.9484536082473,9438,48,94,"",null,null,null,null,null,null,null,{"$f":"DEC2HEX(EEPROM16!K18,2)","v":"57"}]
[{"$f":"IF($B138>255,CONCATENATE(\"ERROR: Timer1H too large\"),\"\")","v":""},{"$f":"IF((B137+1)<(N$44+$B$9),B137+1,\"- End -\")","v":152},{"$f":"IFERROR(1000000/(B138*256*($N$30/$C$4)),\"\")","v":12.849506578947368},770,216.45021645021646,5,9.7402597402597397,9740.2597402597403,9514,49,95,"",null,null,null,null,null,null,null,{"$f":"DEC2HEX(EEPROM16!L18,2)","v":"57"}]
["",153,12.765522875816993,{"$f":"INT(60*C139*$N$25/2*$N$24)","v":765},217.86492374727669,5,9.8039215686274517,9803.9215686274511,{"$f":"IF($H139>$I$4+$I$6,INT($H139-$I$4-$I$6),\"out of range\")","v":9577},50,95,"",null,null,null,null,null,null,"x",{"$f":"DEC2HEX(EEPROM16!M18,2)","v":"58"}]
["",154,12.682629870129871,760,219.29824561403507,5,9.8684210526315788,9868.4210526315783,9642,51,96,"",null,null,null,null,null,null,null,{"$f":"DEC2HEX(EEPROM16!F19,2)","v":"59"}]
["",155,12.600806451612904,756,220.45855379188711,5,9.9206349206349209,9920.6349206349205,9694,52,96,"",null,null,null,null,null,null,null,{"$f":"DEC2HEX(EEPROM16!G19,2)","v":"59"}]
["",156,12.520032051282051,751,221.92632046160676,5,9.9866844207723044,9986.6844207723043,9760,53,97,"",null,null,null,null,null,null,null,{"$f":"DEC2HEX(EEPROM16!H19,2)","v":"5A"}]
["",157,12.440286624203821,746,223.41376228775695,5,10.053619302949063,10053.619302949062,9827,54,98,"",null,null,null,null,null,null,null,{"$f":"DEC2HEX(EEPROM16!I19,2)","v":"5B"}]
["",158,12.361550632911392,741,224.92127755285651,5,10.121457489878543,10121.457489878543,9895,55,98,"",null,null,null,null,null,null,null,{"$f":"DEC2HEX(EEPROM16!J19,2)","v":"5B"}]
["",159,12.283805031446541,737,226.14201718679331,5,10.1763907734057,10176.390773405699,9950,56,99,"",null,null,null,null,null,null,null,{"$f":"DEC2HEX(EEPROM16!K19,2)","v":"5C"}]
["",160,12.20703125,732,227.68670309653913,5,10.245901639344261,10245.901639344262,10019,57,100,"",null,null,null,null,null,null,null,{"$f":"DEC2HEX(EEPROM16!L19,2)","v":"5D"}]
["",161,12.131211180124224,727,229.25263640531864,5,10.316368638239339,10316.368638239339,10090,58,100,"",null,null,null,null,null,null,"x",{"$f":"DEC2HEX(EEPROM16!M19,2)","v":"5D"}]
["",162,12.056327160493828,723,230.52097740894419,5,10.373443983402488,10373.443983402489,10147,59,101,"",null,null,null,null,null,null,null,{"$f":"DEC2HEX(EEPROM16!F20,2)","v":"5E"}]
["",163,11.982361963190185,718,232.12627669452183,5,10.445682451253482,10445.682451253482,10219,60,102,"",null,null,null,null,null,null,null,{"$f":"DEC2HEX(EEPROM16!G20,2)","v":"5F"}]
["",164,11.909298780487806,714,233.42670401493933,5,10.504201680672269,10504.20168067227,10278,61,102,"",null,null,null,null,null,null,null,{"$f":"DEC2HEX(EEPROM16!H20,2)","v":"5F"}]
["",165,11.837121212121213,710,234.74178403755869,5,10.56338028169014,10563.380281690141,10337,62,103,"",null,null,null,null,null,null,null,{"$f":"DEC2HEX(EEPROM16!I20,2)","v":"60"}]
["",166,11.765813253012048,705,236.40661938534276,5,10.638297872340425,10638.297872340425,10412,63,104,"",null,null,null,null,null,null,null,{"$f":"DEC2HEX(EEPROM16!J20,2)","v":"60"}]
["",167,11.695359281437126,701,237.75558725630052,5,{"$f":"(E153*($F$5-F153))/1000","v":10.699001426533522},{"$f":"E153*($F$5-F153)","v":10699.001426533523},10473,64,104,"",null,null,null,null,null,null,null,{"$f":"DEC2HEX(EEPROM16!K20,2)","v":"61"}]
["",168,11.625744047619047,697,239.12003825920613,5,10.760401721664275,10760.401721664275,10534,65,105,{"$f":"IF($I154/100>255,CONCATENATE(\"WARNING: Timing will be more then \",F154,\"°\"),\"\")","v":""},null,null,null,null,null,null,null,{"$f":"DEC2HEX(EEPROM16!L20,2)","v":"62"}]
["",169,11.556952662721894,693,240.50024050024052,5,10.822510822510823,10822.510822510823,10596,66,{"$f":"IFERROR(IF($I155/100>255,255,IF($I155>0.01,INT($I155/100),1)),255)","v":105},"",null,null,null,null,null,null,"x",{"$f":"DEC2HEX(EEPROM16!M20,2)","v":"62"}]
["",170,11.488970588235293,689,241.89646831156267,5,10.885341074020319,10885.34107402032,10659,67,106,"",null,null,null,null,null,null,null,{"$f":"DEC2HEX(EEPROM16!F21,2)","v":"63"}]
["",171,11.421783625730994,685,243.30900243309003,5,10.948905109489051,10948.905109489051,10722,68,107,"",null,null,null,null,null,null,null,{"$f":"DEC2HEX(EEPROM16!G21,2)","v":"64"}]
["",172,11.355377906976743,681,244.73813020068528,5,11.013215859030836,11013.215859030837,10787,69,107,"",null,null,null,null,null,null,null,{"$f":"DEC2HEX(EEPROM16!H21,2)","v":"64"}]
["",173,11.289739884393063,677,246.18414574101428,5,11.078286558345642,11078.286558345642,10852,70,108,"",null,null,null,null,null,null,null,{"$f":"DEC2HEX(EEPROM16!I21,2)","v":"65"}]
["",174,11.224856321839081,673,247.64735017335312,5,11.144130757800891,11144.130757800891,10918,71,109,"",null,null,null,null,null,null,null,{"$f":"DEC2HEX(EEPROM16!J21,2)","v":"66"}]
["",175,11.160714285714286,669,249.12805181863479,5,11.210762331838565,11210.762331838565,10984,72,109,"",null,null,null,null,null,null,null,{"$f":"DEC2HEX(EEPROM16!K21,2)","v":"66"}]
["",176,11.097301136363637,665,250.62656641604011,5,11.278195488721805,11278.195488721805,11052,73,110,"",null,null,null,null,null,null,null,{"$f":"DEC2HEX(EEPROM16!L21,2)","v":"67"}]
["",177,11.034604519774012,662,251.76233635448136,5,11.32930513595166,11329.305135951661,11103,74,111,"",null,null,null,null,null,null,"x",{"$f":"DEC2HEX(EEPROM16!M21,2)","v":"68"}]
["",178,10.972612359550562,658,253.29280648429585,5,11.398176291793314,11398.176291793314,11172,75,111,"",null,null,null,null,null,null,null,{"$f":"DEC2HEX(EEPROM16!F22,2)","v":"68"}]
["",179,10.911312849162011,654,254.84199796126401,5,11.467889908256881,11467.889908256881,11241,76,112,"",null,null,null,null,null,null,null,{"$f":"DEC2HEX(EEPROM16!G22,2)","v":"69"}]
["",180,10.850694444444445,651,256.01638504864314,5,11.520737327188941,11520.737327188941,11294,77,112,"",null,null,null,null,null,null,null,{"$f":"DEC2HEX(EEPROM16!H22,2)","v":"69"}]
["",181,10.790745856353592,647,257.59917568263779,5,11.591962905718701,11591.962905718701,11365,78,113,"",null,null,null,null,null,null,null,{"$f":"DEC2HEX(EEPROM16!I22,2)","v":"6A"}]
["",182,10.731456043956044,643,259.2016588906169,5,11.66407465007776,11664.07465007776,11438,79,114,"",null,null,null,null,null,null,null,{"$f":"DEC2HEX(EEPROM16!J22,2)","v":"6B"}]
["ERROR: Timer1H too large","- End -",{"$f":"IFERROR(1000000/(B169*256*($N$30/$C$4)),\"\")","v":""},{"$error":"#VALUE!"},{"$error":"#VALUE!"},5,{"$error":"#VALUE!"},{"$error":"#VALUE!"},{"$error":"#VALUE!"},80,255,{"$error":"#VALUE!"},null,null,null,null,null,null,null,{"$f":"DEC2HEX(EEPROM16!K22,2)","v":"6B"}]
[null,null,null,null,null,null,null,null,null,null,null,null,null,null,null,null,null,null,null,{"$f":"DEC2HEX(EEPROM16!L22,2)","v":"6C"}]
[null,null,null,null,null,null,null,null,null,null,null,null,null,null,null,null,null,null,"x",{"$f":"DEC2HEX(EEPROM16!M22,2)","v":"6D"}]
[null,null,null,null,null,null,null,null,null,null,null,null,null,null,null,null,null,null,null,{"$f":"DEC2HEX(EEPROM16!F23,2)","v":"6D"}]
[null,null,null,null,null,null,null,null,null,null,null,null,null,null,null,null,null,null,null,{"$f":"DEC2HEX(EEPROM16!G23,2)","v":"6E"}]
[null,null,null,null,null,null,null,null,null,null,null,null,null,null,null,null,null,null,null,{"$f":"DEC2HEX(EEPROM16!H23,2)","v":"6F"}]
[null,{"$f":"IFERROR(B9,\"\")","v":23},84.918478260869563,5095,null,null,null,null,null,null,null,null,null,null,null,null,null,null,null,{"$f":"DEC2HEX(EEPROM16!I23,2)","v":"6F"}]
[null,24,81.380208333333329,4882,null,null,null,null,null,null,null,null,null,null,null,null,null,null,null,{"$f":"DEC2HEX(EEPROM16!J23,2)","v":"70"}]
[null,25,78.125,4687,null,null,null,null,null,null,null,null,null,null,null,null,null,null,null,{"$f":"DEC2HEX(EEPROM16!K23,2)","v":"70"}]
[null,26,75.120192307692307,4507,null,null,null,null,null,null,null,null,null,null,null,null,null,null,null,{"$f":"DEC2HEX(EEPROM16!L23,2)","v":"71"}]
[null,27,72.337962962962962,4340,null,null,null,null,null,null,null,null,null,null,null,null,null,null,"x",{"$f":"DEC2HEX(EEPROM16!M23,2)","v":"72"}]
[null,28,69.754464285714292,4185,null,null,null,null,null,null,null,null,null,null,null,null,null,null,null,{"$f":"DEC2HEX(EEPROM16!F24,2)","v":"00"}]
[null,29,67.349137931034477,4040,null,null,null,null,null,null,null,null,null,null,null,null,null,null,null,{"$f":"DEC2HEX(EEPROM16!G24,2)","v":"00"}]
[null,30,65.104166666666671,3906,null,null,null,null,null,null,null,null,null,null,null,null,null,null,null,{"$f":"DEC2HEX(EEPROM16!H24,2)","v":"00"}]
[null,31,63.00403225806452,3780,null,null,null,null,null,null,null,null,null,null,null,null,null,null,null,{"$f":"DEC2HEX(EEPROM16!I24,2)","v":"00"}]
[null,32,61.03515625,3662,null,null,null,null,null,null,null,null,null,null,null,null,null,null,null,{"$f":"DEC2HEX(EEPROM16!J24,2)","v":"00"}]
[null,33,59.185606060606062,3551,null,null,null,null,null,null,null,null,null,null,null,null,null,null,null,{"$f":"DEC2HEX(EEPROM16!K24,2)","v":"00"}]
[null,34,57.444852941176471,3446,null,null,null,null,null,null,null,null,null,null,null,null,null,null,null,{"$f":"DEC2HEX(EEPROM16!L24,2)","v":"00"}]
[null,35,55.803571428571431,3348,null,null,null,null,null,null,null,null,null,null,null,null,null,null,"x",{"$f":"DEC2HEX(EEPROM16!M24,2)","v":"00"}]
[null,36,54.253472222222221,3255,null,null,null,null,null,null,null,null,null,null,null,null,null,null,null,{"$f":"DEC2HEX(EEPROM16!F25,2)","v":"00"}]
[null,37,52.787162162162161,3167,null,null,null,null,null,null,null,null,null,null,null,null,null,null,null,{"$f":"DEC2HEX(EEPROM16!G25,2)","v":"00"}]
[null,38,51.398026315789473,3083,null,null,null,null,null,null,null,null,null,null,null,null,null,null,null,{"$f":"DEC2HEX(EEPROM16!H25,2)","v":"00"}]
[null,39,50.080128205128204,3004,null,null,null,null,null,null,null,null,null,null,null,null,null,null,null,{"$f":"DEC2HEX(EEPROM16!I25,2)","v":"00"}]
[null,40,48.828125,2929,null,null,null,null,null,null,null,null,null,null,null,null,null,null,null,{"$f":"DEC2HEX(EEPROM16!J25,2)","v":"00"}]
[null,41,47.637195121951223,2858,null,null,null,null,null,null,null,null,null,null,null,null,null,null,null,{"$f":"DEC2HEX(EEPROM16!K25,2)","v":"00"}]
[null,42,46.50297619047619,2790,null,null,null,null,null,null,null,null,null,null,null,null,null,null,null,{"$f":"DEC2HEX(EEPROM16!L25,2)","v":"00"}]
[null,{"$f":"IFERROR(B29,\"\")","v":43},45.421511627906973,2725,null,null,null,null,null,null,null,null,null,null,null,null,null,null,"x",{"$f":"DEC2HEX(EEPROM16!M25,2)","v":"00"}]
[null,44,44.389204545454547,2663,null,null,null,null,null,null,null,null,null,null,null,null,null,null,null,{"$f":"DEC2HEX(EEPROM16!F26,2)","v":"00"}]
[null,45,43.402777777777779,2604,null,null,null,null,null,null,null,null,null,null,null,null,null,null,null,{"$f":"DEC2HEX(EEPROM16!G26,2)","v":"00"}]
[null,46,42.459239130434781,2547,null,null,null,null,null,null,null,null,null,null,null,null,null,null,null,{"$f":"DEC2HEX(EEPROM16!H26,2)","v":"00"}]
[null,47,41.555851063829785,2493,null,null,null,null,null,null,null,null,null,null,null,null,null,null,null,{"$f":"DEC2HEX(EEPROM16!I26,2)","v":"00"}]
[null,48,40.690104166666664,2441,null,null,null,null,null,null,null,null,null,null,null,null,null,null,null,{"$f":"DEC2HEX(EEPROM16!J26,2)","v":"00"}]
[null,49,39.859693877551024,2391,null,null,null,null,null,null,null,null,null,null,null,null,null,null,null,{"$f":"DEC2HEX(EEPROM16!K26,2)","v":"00"}]
[null,50,39.0625,2343,null,null,null,null,null,null,null,null,null,null,null,null,null,null,null,{"$f":"DEC2HEX(EEPROM16!L26,2)","v":"00"}]
[null,51,38.296568627450981,2297,null,null,null,null,null,null,null,null,null,null,null,null,null,null,"x",{"$f":"DEC2HEX(EEPROM16!M26,2)","v":"00"}]
[null,52,37.560096153846153,2253,null,null,null,null,null,null,null,null,null,null,null,null,null,null,null,{"$f":"DEC2HEX(EEPROM16!F27,2)","v":"00"}]
[null,53,36.851415094339622,2211,null,null,null,null,null,null,null,null,null,null,null,null,null,null,null,{"$f":"DEC2HEX(EEPROM16!G27,2)","v":"00"}]
[null,54,36.168981481481481,2170,null,null,null,null,null,null,null,null,null,null,null,null,null,null,null,{"$f":"DEC2HEX(EEPROM16!H27,2)","v":"00"}]
[null,55,35.511363636363633,2130,null,null,null,null,null,null,null,null,null,null,null,null,null,null,null,{"$f":"DEC2HEX(EEPROM16!I27,2)","v":"00"}]
[null,56,34.877232142857146,2092,null,null,null,null,null,null,null,null,null,null,null,null,null,null,null,{"$f":"DEC2HEX(EEPROM16!J27,2)","v":"00"}]
[null,57,34.265350877192979,2055,null,null,null,null,null,null,null,null,null,null,null,null,null,null,null,{"$f":"DEC2HEX(EEPROM16!K27,2)","v":"00"}]
[null,58,33.674568965517238,2020,null,null,null,null,null,null,null,null,null,null,null,null,null,null,null,{"$f":"DEC2HEX(EEPROM16!L27,2)","v":"00"}]
[null,59,33.103813559322035,1986,null,null,null,null,null,null,null,null,null,null,null,null,null,null,"x",{"$f":"DEC2HEX(EEPROM16!M27,2)","v":"00"}]
[null,60,32.552083333333336,1953,null,null,null,null,null,null,null,null,null,null,null,null,null,null,null,{"$f":"DEC2HEX(EEPROM16!F28,2)","v":"00"}]
[null,61,32.018442622950822,1921,null,null,null,null,null,null,null,null,null,null,null,null,null,null,null,{"$f":"DEC2HEX(EEPROM16!G28,2)","v":"00"}]
[null,62,31.50201612903226,1890,null,null,null,null,null,null,null,null,null,null,null,null,null,null,null,{"$f":"DEC2HEX(EEPROM16!H28,2)","v":"00"}]
[null,{"$f":"IFERROR(B49,\"\")","v":63},31.001984126984127,1860,null,null,null,null,null,null,null,null,null,null,null,null,null,null,null,{"$f":"DEC2HEX(EEPROM16!I28,2)","v":"00"}]
[null,64,30.517578125,1831,null,null,null,null,null,null,null,null,null,null,null,null,null,null,null,{"$f":"DEC2HEX(EEPROM16!J28,2)","v":"00"}]
[null,65,30.048076923076923,1802,null,null,null,null,null,null,null,null,null,null,null,null,null,null,null,{"$f":"DEC2HEX(EEPROM16!K28,2)","v":"00"}]
[null,66,29.592803030303031,1775,null,null,null,null,null,null,null,null,null,null,null,null,null,null,null,{"$f":"DEC2HEX(EEPROM16!L28,2)","v":"00"}]
[null,67,29.151119402985074,1749,null,null,null,null,null,null,null,null,null,null,null,null,null,null,"x",{"$f":"DEC2HEX(EEPROM16!M28,2)","v":"00"}]
[null,68,28.722426470588236,1723,null,null,null,null,null,null,null,null,null,null,null,null,null,null,null,{"$f":"DEC2HEX(EEPROM16!F29,2)","v":"00"}]
[null,69,28.306159420289855,1698,null,null,null,null,null,null,null,null,null,null,null,null,null,null,null,{"$f":"DEC2HEX(EEPROM16!G29,2)","v":"00"}]
[null,70,27.901785714285715,1674,null,null,null,null,null,null,null,null,null,null,null,null,null,null,null,{"$f":"DEC2HEX(EEPROM16!H29,2)","v":"00"}]
[null,71,27.508802816901408,1650,null,null,null,null,null,null,null,null,null,null,null,null,null,null,null,{"$f":"DEC2HEX(EEPROM16!I29,2)","v":"00"}]
[null,72,27.126736111111111,1627,null,null,null,null,null,null,null,null,null,null,null,null,null,null,null,{"$f":"DEC2HEX(EEPROM16!J29,2)","v":"00"}]
[null,73,26.75513698630137,1605,null,null,null,null,null,null,null,null,null,null,null,null,null,null,null,{"$f":"DEC2HEX(EEPROM16!K29,2)","v":"00"}]
[null,74,26.393581081081081,1583,null,null,null,null,null,null,null,null,null,null,null,null,null,null,null,{"$f":"DEC2HEX(EEPROM16!L29,2)","v":"00"}]
[null,75,26.041666666666668,1562,null,null,null,null,null,null,null,null,null,null,null,null,null,null,"x",{"$f":"DEC2HEX(EEPROM16!M29,2)","v":"00"}]
[null,76,25.699013157894736,1541,null,null,null,null,null,null,null,null,null,null,null,null,null,null,null,{"$f":"DEC2HEX(EEPROM16!F30,2)","v":"00"}]
[null,77,25.365259740259742,1521,null,null,null,null,null,null,null,null,null,null,null,null,null,null,null,{"$f":"DEC2HEX(EEPROM16!G30,2)","v":"00"}]
[null,78,25.040064102564102,1502,null,null,null,null,null,null,null,null,null,null,null,null,null,null,null,{"$f":"DEC2HEX(EEPROM16!H30,2)","v":"00"}]
[null,79,24.723101265822784,1483,null,null,null,null,null,null,null,null,null,null,null,null,null,null,null,{"$f":"DEC2HEX(EEPROM16!I30,2)","v":"00"}]
[null,80,24.4140625,1464,null,null,null,null,null,null,null,null,null,null,null,null,null,null,null,{"$f":"DEC2HEX(EEPROM16!J30,2)","v":"00"}]
[null,81,24.112654320987655,1446,null,null,null,null,null,null,null,null,null,null,null,null,null,null,null,{"$f":"DEC2HEX(EEPROM16!K30,2)","v":"00"}]
[null,82,23.818597560975611,1429,null,null,null,null,null,null,null,null,null,null,null,null,null,null,null,{"$f":"DEC2HEX(EEPROM16!L30,2)","v":"00"}]
[null,{"$f":"IFERROR(B69,\"\")","v":83},23.531626506024097,1411,null,null,null,null,null,null,null,null,null,null,null,null,null,null,"x",{"$f":"DEC2HEX(EEPROM16!M30,2)","v":"00"}]
[null,84,23.251488095238095,1395,null,null,null,null,null,null,null,null,null,null,null,null,null,null,null,{"$f":"DEC2HEX(EEPROM16!F31,2)","v":"00"}]
[null,85,22.977941176470587,1378,null,null,null,null,null,null,null,null,null,null,null,null,null,null,null,{"$f":"DEC2HEX(EEPROM16!G31,2)","v":"00"}]
[null,86,22.710755813953487,1362,null,null,null,null,null,null,null,null,null,null,null,null,null,null,null,{"$f":"DEC2HEX(EEPROM16!H31,2)","v":"00"}]
[null,87,22.449712643678161,1346,null,null,null,null,null,null,null,null,null,null,null,null,null,null,null,{"$f":"DEC2HEX(EEPROM16!I31,2)","v":"00"}]
[null,88,22.194602272727273,1331,null,null,null,null,null,null,null,null,null,null,null,null,null,null,null,{"$f":"DEC2HEX(EEPROM16!J31,2)","v":"00"}]
[null,89,21.945224719101123,1316,null,null,null,null,null,null,null,null,null,null,null,null,null,null,null,{"$f":"DEC2HEX(EEPROM16!K31,2)","v":"00"}]
[null,90,21.701388888888889,1302,null,null,null,null,null,null,null,null,null,null,null,null,null,null,null,{"$f":"DEC2HEX(EEPROM16!L31,2)","v":"00"}]
[null,91,21.462912087912088,1287,null,null,null,null,null,null,null,null,null,null,null,null,null,null,"x",{"$f":"DEC2HEX(EEPROM16!M31,2)","v":"00"}]
[null,92,21.229619565217391,1273,null,null,null,null,null,null,null,null,null,null,null,null,null,null,null,{"$f":"DEC2HEX(EEPROM16!F32,2)","v":"00"}]
[null,93,21.001344086021504,1260,null,null,null,null,null,null,null,null,null,null,null,null,null,null,null,{"$f":"DEC2HEX(EEPROM16!G32,2)","v":"00"}]
[null,94,20.777925531914892,1246,null,null,null,null,null,null,null,null,null,null,null,null,null,null,null,{"$f":"DEC2HEX(EEPROM16!H32,2)","v":"00"}]
[null,95,20.559210526315791,1233,null,null,null,null,null,null,null,null,null,null,null,null,null,null,null,{"$f":"DEC2HEX(EEPROM16!I32,2)","v":"00"}]
[null,96,20.345052083333332,1220,null,null,null,null,null,null,null,null,null,null,null,null,null,null,null,{"$f":"DEC2HEX(EEPROM16!J32,2)","v":"00"}]
[null,97,20.135309278350515,1208,null,null,null,null,null,null,null,null,null,null,null,null,null,null,null,{"$f":"DEC2HEX(EEPROM16!K32,2)","v":"00"}]
[null,98,19.929846938775512,1195,null,null,null,null,null,null,null,null,null,null,null,null,null,null,null,{"$f":"DEC2HEX(EEPROM16!L32,2)","v":"00"}]
[null,99,19.728535353535353,1183,null,null,null,null,null,null,null,null,null,null,null,null,null,null,"x",{"$f":"DEC2HEX(EEPROM16!M32,2)","v":"00"}]
[null,100,19.53125,1171,null,null,null,null,null,null,null,null,null,null,null,null,null,null,null,{"$f":"DEC2HEX(EEPROM16!F33,2)","v":"4F"}]
[null,101,19.337871287128714,1160,null,null,null,null,null,null,null,null,null,null,null,null,null,null,null,{"$f":"DEC2HEX(EEPROM16!G33,2)","v":"19"}]
[null,102,19.14828431372549,1148,null,null,null,null,null,null,null,null,null,null,null,null,null,null,null,{"$f":"DEC2HEX(EEPROM16!H33,2)","v":"01"}]
[null,{"$f":"IFERROR(B89,\"\")","v":103},18.962378640776699,1137,null,null,null,null,null,null,null,null,null,null,null,null,null,null,null,{"$f":"DEC2HEX(EEPROM16!I33,2)","v":"00"}]
[null,104,18.780048076923077,1126,null,null,null,null,null,null,null,null,null,null,null,null,null,null,null,{"$f":"DEC2HEX(EEPROM16!J33,2)","v":"00"}]
[null,105,18.601190476190474,1116,null,null,null,null,null,null,null,null,null,null,null,null,null,null,null,{"$f":"DEC2HEX(EEPROM16!K33,2)","v":"00"}]
[null,106,18.425707547169811,1105,null,null,null,null,null,null,null,null,null,null,null,null,null,null,null,{"$f":"DEC2HEX(EEPROM16!L33,2)","v":"00"}]
[null,107,18.253504672897197,1095,null,null,null,null,null,null,null,null,null,null,null,null,null,null,"x",{"$f":"DEC2HEX(EEPROM16!M33,2)","v":"00"}]
[null,108,18.08449074074074,1085,null,null,null,null,null,null,null,null,null,null,null,null,null,null,null,{"$f":"DEC2HEX(EEPROM16!F34,2)","v":"A0"}]
[null,109,17.918577981651374,1075,null,null,null,null,null,null,null,null,null,null,null,null,null,null,null,{"$f":"DEC2HEX(EEPROM16!G34,2)","v":"00"}]
[null,110,17.755681818181817,1065,null,null,null,null,null,null,null,null,null,null,null,null,null,null,null,{"$f":"DEC2HEX(EEPROM16!H34,2)","v":"32"}]
[null,111,17.59572072072072,1055,null,null,null,null,null,null,null,null,null,null,null,null,null,null,null,{"$f":"DEC2HEX(EEPROM16!I34,2)","v":"01"}]
[null,112,17.438616071428573,1046,null,null,null,null,null,null,null,null,null,null,null,null,null,null,null,{"$f":"DEC2HEX(EEPROM16!J34,2)","v":"C8"}]
[null,113,17.284292035398231,1037,null,null,null,null,null,null,null,null,null,null,null,null,null,null,null,{"$f":"DEC2HEX(EEPROM16!K34,2)","v":"01"}]
[null,114,17.13267543859649,1027,null,null,null,null,null,null,null,null,null,null,null,null,null,null,null,{"$f":"DEC2HEX(EEPROM16!L34,2)","v":"01"}]
[null,115,16.983695652173914,1019,null,null,null,null,null,null,null,null,null,null,null,null,null,null,"x",{"$f":"DEC2HEX(EEPROM16!M34,2)","v":"00"}]
[null,116,16.837284482758619,1010,null,null,null,null,null,null,null,null,null,null,null,null,null,null,null,{"$f":"DEC2HEX(EEPROM16!F35,2)","v":"1A"}]
[null,117,16.693376068376068,1001,null,null,null,null,null,null,null,null,null,null,null,null,null,null,null,{"$f":"DEC2HEX(EEPROM16!G35,2)","v":"17"}]
[null,118,16.551906779661017,993,null,null,null,null,null,null,null,null,null,null,null,null,null,null,null,{"$f":"DEC2HEX(EEPROM16!H35,2)","v":"04"}]
[null,119,16.412815126050422,984,null,null,null,null,null,null,null,null,null,null,null,null,null,null,null,{"$f":"DEC2HEX(EEPROM16!I35,2)","v":"08"}]
[null,120,16.276041666666668,976,null,null,null,null,null,null,null,null,null,null,null,null,null,null,null,{"$f":"DEC2HEX(EEPROM16!J35,2)","v":"00"}]
[null,121,16.141528925619834,968,null,null,null,null,null,null,null,null,null,null,null,null,null,null,null,{"$f":"DEC2HEX(EEPROM16!K35,2)","v":"28"}]
[null,122,16.009221311475411,960,null,null,null,null,null,null,null,null,null,null,null,null,null,null,null,{"$f":"DEC2HEX(EEPROM16!L35,2)","v":"17"}]
[null,{"$f":"IFERROR(B109,\"\")","v":123},15.879065040650406,952,null,null,null,null,null,null,null,null,null,null,null,null,null,null,"x",{"$f":"DEC2HEX(EEPROM16!M35,2)","v":"B6"}]
[null,124,15.75100806451613,945]
[null,125,15.625,937]
[null,126,15.500992063492063,930]
[null,127,15.378937007874017,922]
[null,128,15.2587890625,915]
[null,129,15.140503875968992,908]
[null,130,15.024038461538462,901]
[null,131,14.909351145038167,894]
[null,132,14.796401515151516,887]
[null,133,14.68515037593985,881]
[null,134,14.575559701492537,874]
[null,135,14.467592592592593,868]
[null,136,14.361213235294118,861]
[null,137,14.256386861313869,855]
[null,138,14.153079710144928,849]
[null,139,14.051258992805755,843]
[null,140,13.950892857142858,837]
[null,141,13.851950354609929,831]
[null,142,13.754401408450704,825]
[null,{"$f":"IFERROR(B129,\"\")","v":143},13.658216783216783,819]
[null,144,13.563368055555555,813]
[null,145,13.469827586206897,808]
[null,146,13.377568493150685,802]
[null,147,13.286564625850341,797]
[null,148,13.19679054054054,791]
[null,149,13.108221476510067,786]
[null,150,13.020833333333334,781]
[null,151,12.934602649006623,776]
[null,152,12.849506578947368,770]
[null,153,12.765522875816993,765]
[null,154,12.682629870129871,760]
[null,155,12.600806451612904,756]
[null,156,12.520032051282051,751]
[null,157,12.440286624203821,746]
[null,158,12.361550632911392,741]
[null,159,12.283805031446541,737]
[null,160,12.20703125,732]
[null,161,12.131211180124224,727]
[null,162,12.056327160493828,723]
[null,{"$f":"IFERROR(B149,\"\")","v":163},11.982361963190185,718]
[null,164,11.909298780487806,714]
[null,165,11.837121212121213,710]
[null,166,11.765813253012048,705]
[null,167,11.695359281437126,701]
[null,168,11.625744047619047,697]
[null,169,11.556952662721894,693]
[null,170,11.488970588235293,689]
[null,171,11.421783625730994,685]
[null,172,11.355377906976743,681]
[null,173,11.289739884393063,677]
[null,174,11.224856321839081,673]
[null,175,11.160714285714286,669]
[null,176,11.097301136363637,665]
[null,177,11.034604519774012,662]
[null,178,10.972612359550562,658]
[null,179,10.911312849162011,654]
[null,180,10.850694444444445,651]
[null,181,10.790745856353592,647]
[null,182,10.731456043956044,643]
[null,{"$f":"IFERROR(B169,\"\")","v":"- End -"},"",""]

{"sheet":"LowRPM","index":2,"n_rows":36,"n_cols":26,"rows_kept":36,"cut":false,"hidden":false,"merged":[[0,6,0,7]]}
[]
[null,"Advance at low RPM",null,{"$f":"CONCATENATE(\"from \",L7,\" to\")","v":"from 76 to"},{"$f":"CONCATENATE(ROUNDDOWN(Advance_curve!C7,0),\" RPM\")","v":"643 RPM"},null,null,"VLRPM",26,"us"]
[]
[null,null,null,"Cylinder(s) =",{"$f":"Advance_curve!N24","v":1},null,null,"Fosc/4",{"$f":"Advance_curve!C4","v":4},"MHz","TMR1deb max",{"$f":"48/I5","v":6}]
[null,null,null,"Strokes =",{"$f":"Advance_curve!N25","v":2},"STK",null,"Prescaler",{"$f":"Advance_curve!N30","v":8},null,"durée debords max",{"$f":"L4*I7","v":780.30000000000007},"ms"]
[null,null,null,"Pkp position =",{"$f":"Advance_curve!$F$5","v":50},"° BTDC",null,"periode TMR1L",{"$f":"I5/I4","v":2},"ms","Frq mini",{"$f":"1000/L5","v":1.2815583749839805},"Hz","Frq",null,"periode","periode","1°","Timer1","TMR1h","TMR1deb","TMR1rest","Delay","Delay needed","Delay","advance"]
[null,null,null,"RPM limit =",{"$f":"IF(Advance_curve!N30=1,\"336\",IF(Advance_curve!N30=2,\"168\",IF(Advance_curve!N30=4,\"84\",IF(Advance_curve!N30=8,\"42\",\"False\"))))","v":"42"},"RPM",null,"débord TMR1H",{"$f":"255*255*I6/1000","v":130.05000000000001},"ms","RPM mini",{"$f":"INT(60*L6*E5/2*E4)","v":76},"RPM","Hz","RPM","µs","ms","us",null,null,null,null,"µs","µs","degres","degres BTDC"]
[null,null,null,null,null,null,null,null,null,null,null,null,null,1,{"$f":"IF(N8=\"End\",\" \",(N8*60*$E$5)/(2*$E$4))","v":60},{"$f":"1000000/N8","v":1000000},{"$f":"P8/1000","v":1000},{"$f":"((1000*1000*60)/($E$4*O8))/360","v":2777.7777777777778},{"$f":"IF(N8=\"End\",\" \",INT(P8*Advance_curve!$C$4)/$I$5)","v":500000},{"$f":"IF(N8=\"End\",\" \",S8/255)","v":1960.7843137254902},{"$f":"INT(T8/255)","v":7},{"$f":"T8-U8*255","v":175.78431372549016},{"$f":"IF(U8<6,(U8*255*$I$2)+(V8*($I$2+0)),$I$2*(5*255+V8))","v":37720.392156862741},{"$f":"W8","v":37720.392156862741},{"$f":"X8/R8","v":13.579341176470587},{"$f":"$E$6-Y8","v":36.420658823529415}]
[null,null,null,null,null,null,null,"temps calcul",22,"µs",null,null,null,1.5,{"$f":"IF(N9=\"End\",\" \",(N9*60*$E$5)/(2*$E$4))","v":90},{"$f":"1000000/N9","v":666666.66666666663},{"$f":"P9/1000","v":666.66666666666663},{"$f":"((1000*1000*60)/($E$4*O9))/360","v":1851.8518518518517},{"$f":"IF(N9=\"End\",\" \",INT(P9*Advance_curve!$C$4)/$I$5)","v":333333.25},{"$f":"IF(N9=\"End\",\" \",S9/255)","v":1307.1892156862746},{"$f":"INT(T9/255)","v":5},{"$f":"T9-U9*255","v":32.189215686274565},33986.919607843141,{"$f":"W9","v":33986.919607843141},{"$f":"X9/R9","v":18.352936588235298},{"$f":"$E$6-Y9","v":31.647063411764702}]
[null,null,null,null,null,null,null,"hysteresis",{"$f":"Advance_curve!I6","v":200},"µs",null,null,null,{"$f":"IF(N8<Advance_curve!C$6,N8+1,\"End\")","v":2},120,500000,500,{"$f":"((1000*1000*60)/($E$4*O10))/360","v":1388.8888888888889},{"$f":"IF(N10=\"End\",\" \",INT(P10*Advance_curve!$C$4)/$I$5)","v":250000},980.39215686274508,{"$f":"INT(T10/255)","v":3},{"$f":"T10-U10*255","v":215.39215686274508},25490.196078431371,25490.196078431371,{"$f":"X10/R10","v":18.352941176470587},{"$f":"$E$6-Y10","v":31.647058823529413}]
[null,null,null,null,null,null,null,null,null,null,null,null,null,{"$f":"IF(N10<Advance_curve!$C$6,N10+1,\"End\")","v":3},180,333333.33333333331,333.33333333333331,925.92592592592587,{"$f":"IF(N11=\"End\",\" \",INT(P11*Advance_curve!$C$4)/$I$5)","v":166666.625},653.59460784313728,2,143.59460784313728,16993.459803921571,16993.459803921571,{"$f":"X11/R11","v":18.352936588235298},{"$f":"IF($U11<5,$E$6-Y11,\"0\")","v":31.647063411764702}]
[null,null,null,null,null,null,null,null,null,null,null,null,null,{"$f":"IF(N11<Advance_curve!$C$6,N11+1,\"End\")","v":4},240,250000,250,694.44444444444446,{"$f":"IF(N12=\"End\",\" \",INT(P12*Advance_curve!$C$4)/$I$5)","v":125000},490.19607843137254,1,235.19607843137254,12745.098039215685,12745.098039215685,18.352941176470587,31.647058823529413]
[null,null,null,null,null,null,null,null,null,null,null,null,null,{"$f":"IF(N12<Advance_curve!$C$6,N12+1,\"End\")","v":5},300,200000,200,555.55555555555554,{"$f":"IF(N13=\"End\",\" \",INT(P13*Advance_curve!$C$4)/$I$5)","v":100000},392.15686274509807,1,137.15686274509807,10196.078431372549,10196.078431372549,18.352941176470587,31.647058823529413]
[null,null,null,null,null,null,null,null,null,null,null,null,null,{"$f":"IF(N13<Advance_curve!$C$6,N13+1,\"End\")","v":6},360,166666.66666666666,166.66666666666666,462.96296296296293,{"$f":"IF(N14=\"End\",\" \",INT(P14*Advance_curve!$C$4)/$I$5)","v":83333.25},326.79705882352943,1,71.797058823529426,8496.7235294117654,8496.7235294117654,18.352922823529415,31.647077176470585]
[null,null,null,null,null,null,null,null,null,null,null,null,null,{"$f":"IF(N14<Advance_curve!$C$6,N14+1,\"End\")","v":7},420,142857.14285714287,142.85714285714286,396.82539682539687,{"$f":"IF(N15=\"End\",\" \",INT(P15*Advance_curve!$C$4)/$I$5)","v":71428.5},280.11176470588236,1,25.111764705882365,7282.9058823529413,7282.9058823529413,18.352922823529411,31.647077176470589]
[null,null,null,null,null,null,null,null,null,null,null,null,null,{"$f":"IF(N15<Advance_curve!$C$6,N15+1,\"End\")","v":8},480,125000,125,347.22222222222223,{"$f":"IF(N16=\"End\",\" \",INT(P16*Advance_curve!$C$4)/$I$5)","v":62500},245.09803921568627,0,245.09803921568627,6372.5490196078426,6372.5490196078426,18.352941176470587,31.647058823529413]
[null,null,null,null,null,null,null,null,null,null,null,null,null,{"$f":"IF(N16<Advance_curve!$C$6,N16+1,\"End\")","v":9},540,111111.11111111111,111.11111111111111,308.64197530864197,{"$f":"IF(N17=\"End\",\" \",INT(P17*Advance_curve!$C$4)/$I$5)","v":55555.5},217.86470588235295,0,217.86470588235295,5664.4823529411769,5664.4823529411769,18.352922823529415,31.647077176470585]
[null,null,null,null,null,null,null,null,null,null,null,null,null,{"$f":"IF(N17<Advance_curve!$C$6,N17+1,\"End\")","v":10},600,100000,100,277.77777777777777,{"$f":"IF(N18=\"End\",\" \",INT(P18*Advance_curve!$C$4)/$I$5)","v":50000},196.07843137254903,0,196.07843137254903,5098.0392156862745,5098.0392156862745,18.352941176470587,31.647058823529413]
[null,null,null,null,null,null,null,null,null,null,null,null,null,{"$f":"IF(N18<Advance_curve!$C$6,N18+1,\"End\")","v":11},660,90909.090909090912,90.909090909090907,252.52525252525254,{"$f":"IF(N19=\"End\",\" \",INT(P19*Advance_curve!$C$4)/$I$5)","v":45454.5},178.25294117647059,0,178.25294117647059,4634.5764705882357,4634.5764705882357,18.352922823529411,31.647077176470589]
[null,null,null,null,null,null,null,null,null,null,null,null,null,{"$f":"IF(N19<Advance_curve!$C$6,N19+1,\"End\")","v":"End"}," ",{"$error":"#VALUE!"},{"$error":"#VALUE!"},{"$error":"#VALUE!"},{"$f":"IF(N20=\"End\",\" \",INT(P20*Advance_curve!$C$4)/$I$5)","v":" "}," ",{"$f":"INT(T20/255)","v":{"$error":"#VALUE!"}},{"$f":"T20-U20*255","v":{"$error":"#VALUE!"}},{"$error":"#VALUE!"},{"$error":"#VALUE!"},{"$error":"#VALUE!"},{"$f":"IF($T20<255,Advance_curve!$F$5-Y20,\"0\")","v":"0"}]
[null,null,null,null,null,null,null,null,null,null,null,null,null,{"$f":"IF(N20<Advance_curve!$C$6,N20+1,\"End\")","v":"End"}," ",{"$error":"#VALUE!"},{"$error":"#VALUE!"},{"$error":"#VALUE!"},{"$f":"IF(N21=\"End\",\" \",INT(P21*Advance_curve!$C$4)/$I$5)","v":" "}," ",{"$error":"#VALUE!"},{"$error":"#VALUE!"},{"$error":"#VALUE!"},{"$error":"#VALUE!"},{"$error":"#VALUE!"},{"$f":"IF($T21<255,Advance_curve!$F$5-Y21,\"0\")","v":"0"}]
[null,null,null,null,null,null,null,null,null,null,null,null,null,{"$f":"IF(N21<Advance_curve!$C$6,N21+1,\"End\")","v":"End"}," ",{"$error":"#VALUE!"},{"$error":"#VALUE!"},{"$error":"#VALUE!"},{"$f":"IF(N22=\"End\",\" \",INT(P22*Advance_curve!$C$4)/$I$5)","v":" "}," ",{"$error":"#VALUE!"},{"$error":"#VALUE!"},{"$error":"#VALUE!"},{"$error":"#VALUE!"},{"$error":"#VALUE!"},{"$f":"IF($T22<255,Advance_curve!$F$5-Y22,\"0\")","v":"0"}]
[null,null,null,null,null,null,null,null,null,null,null,null,null,{"$f":"IF(N22<Advance_curve!$C$6,N22+1,\"End\")","v":"End"}," ",{"$error":"#VALUE!"},{"$error":"#VALUE!"},{"$error":"#VALUE!"},{"$f":"IF(N23=\"End\",\" \",INT(P23*Advance_curve!$C$4)/$I$5)","v":" "}," ",{"$error":"#VALUE!"},{"$error":"#VALUE!"},{"$error":"#VALUE!"},{"$error":"#VALUE!"},{"$error":"#VALUE!"},{"$f":"IF($T23<255,Advance_curve!$F$5-Y23,\"0\")","v":"0"}]
[null,null,null,null,null,null,null,null,null,null,null,null,null,{"$f":"IF(N23<Advance_curve!$C$6,N23+1,\"End\")","v":"End"}," ",{"$error":"#VALUE!"},{"$error":"#VALUE!"},{"$error":"#VALUE!"},{"$f":"IF(N24=\"End\",\" \",INT(P24*Advance_curve!$C$4)/$I$5)","v":" "}," ",{"$error":"#VALUE!"},{"$error":"#VALUE!"},{"$error":"#VALUE!"},{"$error":"#VALUE!"},{"$error":"#VALUE!"},{"$f":"IF($T24<255,Advance_curve!$F$5-Y24,\"0\")","v":"0"}]
[null,null,null,null,null,null,null,null,null,null,null,null,null,{"$f":"IF(N24<Advance_curve!$C$6,N24+1,\"End\")","v":"End"}," ",{"$error":"#VALUE!"},{"$error":"#VALUE!"},{"$error":"#VALUE!"},{"$f":"IF(N25=\"End\",\" \",INT(P25*Advance_curve!$C$4)/$I$5)","v":" "}," ",{"$error":"#VALUE!"},{"$error":"#VALUE!"},{"$error":"#VALUE!"},{"$error":"#VALUE!"},{"$error":"#VALUE!"},{"$f":"IF($T25<255,Advance_curve!$F$5-Y25,\"0\")","v":"0"}]
[null,null,null,null,null,null,null,null,null,null,null,null,null,{"$f":"IF(N25<Advance_curve!$C$6,N25+1,\"End\")","v":"End"}," ",{"$error":"#VALUE!"},{"$error":"#VALUE!"},{"$error":"#VALUE!"},{"$f":"IF(N26=\"End\",\" \",INT(P26*Advance_curve!$C$4)/$I$5)","v":" "},{"$f":"IF(N26=\"End\",\" \",S26/255)","v":" "},{"$error":"#VALUE!"},{"$error":"#VALUE!"},{"$error":"#VALUE!"},{"$error":"#VALUE!"},{"$error":"#VALUE!"},{"$f":"IF($T26<255,Advance_curve!$F$5-Y26,\"0\")","v":"0"}]
[]
[]
[]
[null,null,null,null,null,null,null,"Délai proportionnel aux nbr de débords."]
[]
[null,null,null,null,null,null,null,"Avec Clock 16MHz:"]
[null,null,null,null,null,null,null,"PRESC=1 => TMR1H s'incrémente de 1 en  64us et déborde en 16ms"]
[null,null,null,null,null,null,null,"PRESC=2 => TMR1H s'incrémente de 1 en 128us et déborde en 32ms <==="]
[null,null,null,null,null,null,null,"PRESC=4 => TMR1H s'incrémente de 1 en 256us et déborde en 65ms"]
[null,null,null,null,null,null,null,"PRESC=8 => TMR1H s'incrémente de 1 en 512us et déborde en 131ms"]

{"sheet":"EEPROM16","index":3,"n_rows":81,"n_cols":24,"rows_kept":81,"cut":false,"hidden":false,"merged":[]}
[null,null,null,null,null,null,null,null,null,null,null,null,null,null,"INTEL 16HEX format",null,"RAW format"]
[null,null,null,null,null,null,null,null,null,null,null,null,null,null,":020000040000FA",null,null,null,null,null,null,null,null,"Hash"]
["Bytes\n in Row","Address MSB (hex)","Address LSB (hex)","Address Start (MSB)","Address\nStart\n(LSB)","+0","+1","+2","+3","+4","+5","+6","+7",null,":020000040001F9",null,null,null,"sum[dec]","sum[hex]","LSB","two's\ncomplement [dec]","two's\ncomplement +1","cksum"]
[16,"E0",{"$f":"DEC2HEX(E4,2)","v":"00"},224,0,{"$f":"ROUND(Advance_curve!$K9,0)","v":3},{"$f":"ROUND(Advance_curve!$K10,0)","v":3},{"$f":"ROUND(Advance_curve!$K11,0)","v":4},{"$f":"ROUND(Advance_curve!$K12,0)","v":4},{"$f":"ROUND(Advance_curve!$K13,0)","v":4},{"$f":"ROUND(Advance_curve!$K14,0)","v":5},{"$f":"ROUND(Advance_curve!$K15,0)","v":5},{"$f":"ROUND(Advance_curve!$K16,0)","v":6},null,{"$f":"\":\"&DEC2HEX(A4,2)&B4&C4&\"00\"&DEC2HEX(F4,2)&\"00\"&DEC2HEX(G4,2)&\"00\"&DEC2HEX(H4,2)&\"00\"&DEC2HEX(I4,2)&\"00\"&DEC2HEX(J4,2)&\"00\"&DEC2HEX(K4,2)&\"00\"&DEC2HEX(L4,2)&\"00\"&DEC2HEX(M4,2)&\"00\"&X4","v":":10E0000003000300040004000400050005000600EE"},null,{"$f":"DEC2HEX(F4,2)&\" \"&DEC2HEX(G4,2)&\" \"&DEC2HEX(H4,2)&\" \"&DEC2HEX(I4,2)&\"   \"&DEC2HEX(J4,2)&\" \"&DEC2HEX(K4,2)&\" \"&DEC2HEX(L4,2)&\" \"&DEC2HEX(M4,2)","v":"03 03 04 04   04 05 05 06"},null,{"$f":"SUM(A4,D4:M4)","v":274},{"$f":"DEC2HEX(S4)","v":"112"},{"$f":"RIGHT(T4,2)","v":"12"},{"$f":"255-HEX2DEC(U4)","v":237},{"$f":"V4+1","v":238},{"$f":"IF(W4=256,\"00\",DEC2HEX(W4,2))","v":"EE"}]
[16,"E0","10",224,16,{"$f":"ROUND(Advance_curve!$K17,0)","v":6},{"$f":"ROUND(Advance_curve!$K18,0)","v":6},{"$f":"ROUND(Advance_curve!$K19,0)","v":7},{"$f":"ROUND(Advance_curve!$K20,0)","v":7},{"$f":"ROUND(Advance_curve!$K21,0)","v":8},{"$f":"ROUND(Advance_curve!$K22,0)","v":8},{"$f":"ROUND(Advance_curve!$K23,0)","v":8},{"$f":"ROUND(Advance_curve!K24,0)","v":9},null,":10E0100006000600070007000800080008000900C5",null,"06 06 07 07   08 08 08 09",null,315,"13B","3B",196,197,"C5"]
[16,"E0","20",224,32,{"$f":"ROUND(Advance_curve!$K25,0)","v":9},{"$f":"ROUND(Advance_curve!$K26,0)","v":12},{"$f":"ROUND(Advance_curve!$K27,0)","v":14},{"$f":"ROUND(Advance_curve!$K28,0)","v":16},{"$f":"ROUND(Advance_curve!$K29,0)","v":17},{"$f":"ROUND(Advance_curve!$K30,0)","v":19},{"$f":"ROUND(Advance_curve!$K31,0)","v":21},{"$f":"ROUND(Advance_curve!$K32,0)","v":23},null,":10E0200009000C000E00100011001300150017006D",null,"09 0C 0E 10   11 13 15 17",null,403,"193","93",108,109,"6D"]
[16,"E0","30",224,48,{"$f":"ROUND(Advance_curve!$K33,0)","v":24},{"$f":"ROUND(Advance_curve!$K34,0)","v":26},{"$f":"ROUND(Advance_curve!$K35,0)","v":28},{"$f":"ROUND(Advance_curve!$K36,0)","v":30},{"$f":"ROUND(Advance_curve!$K37,0)","v":31},{"$f":"ROUND(Advance_curve!$K38,0)","v":33},{"$f":"ROUND(Advance_curve!$K39,0)","v":35},{"$f":"ROUND(Advance_curve!$K40,0)","v":37},null,":10E0300018001A001C001E001F00210023002500EC",null,"18 1A 1C 1E   1F 21 23 25",null,532,"214","14",235,236,"EC"]
[16,"E0","40",224,64,{"$f":"ROUND(Advance_curve!$K41,0)","v":39},{"$f":"ROUND(Advance_curve!$K42,0)","v":40},{"$f":"ROUND(Advance_curve!$K43,0)","v":42},{"$f":"ROUND(Advance_curve!$K44,0)","v":44},{"$f":"ROUND(Advance_curve!$K45,0)","v":46},{"$f":"ROUND(Advance_curve!$K46,0)","v":47},{"$f":"ROUND(Advance_curve!$K47,0)","v":49},{"$f":"ROUND(Advance_curve!$K48,0)","v":51},null,":10E04000270028002A002C002E002F00310033006A",null,"27 28 2A 2C   2E 2F 31 33",null,662,"296","96",105,106,"6A"]
[16,"E0","50",224,80,{"$f":"ROUND(Advance_curve!$K49,0)","v":53},{"$f":"ROUND(Advance_curve!$K50,0)","v":54},{"$f":"ROUND(Advance_curve!$K51,0)","v":56},{"$f":"ROUND(Advance_curve!$K52,0)","v":58},{"$f":"ROUND(Advance_curve!$K53,0)","v":60},{"$f":"ROUND(Advance_curve!$K54,0)","v":61},{"$f":"ROUND(Advance_curve!$K55,0)","v":63},{"$f":"ROUND(Advance_curve!$K56,0)","v":65},null,":10E050003500360038003A003C003D003F004100EA",null,"35 36 38 3A   3C 3D 3F 41",null,790,"316","16",233,234,"EA"]
[16,"E0","60",224,96,{"$f":"ROUND(Advance_curve!$K57,0)","v":67},{"$f":"ROUND(Advance_curve!$K58,0)","v":69},{"$f":"ROUND(Advance_curve!$K59,0)","v":70},{"$f":"ROUND(Advance_curve!$K60,0)","v":72},{"$f":"ROUND(Advance_curve!$K61,0)","v":74},{"$f":"ROUND(Advance_curve!$K62,0)","v":76},{"$f":"ROUND(Advance_curve!$K63,0)","v":77},{"$f":"ROUND(Advance_curve!$K64,0)","v":79},null,":10E0600043004500460048004A004C004D004F0068",null,"43 45 46 48   4A 4C 4D 4F",null,920,"398","98",103,104,"68"]
[16,"E0","70",224,112,{"$f":"ROUND(Advance_curve!$K65,0)","v":81},{"$f":"ROUND(Advance_curve!$K66,0)","v":83},{"$f":"ROUND(Advance_curve!$K67,0)","v":84},{"$f":"ROUND(Advance_curve!$K68,0)","v":86},{"$f":"ROUND(Advance_curve!$K69,0)","v":88},{"$f":"ROUND(Advance_curve!$K70,0)","v":90},{"$f":"ROUND(Advance_curve!$K71,0)","v":92},{"$f":"ROUND(Advance_curve!$K72,0)","v":93},null,":10E07000510053005400560058005A005C005D00E7",null,"51 53 54 56   58 5A 5C 5D",null,1049,"419","19",230,231,"E7"]
[16,"E0","80",224,128,{"$f":"ROUND(Advance_curve!$K73,0)","v":95},{"$f":"ROUND(Advance_curve!$K74,0)","v":97},{"$f":"ROUND(Advance_curve!$K75,0)","v":99},{"$f":"ROUND(Advance_curve!$K76,0)","v":100},{"$f":"ROUND(Advance_curve!$K77,0)","v":102},{"$f":"ROUND(Advance_curve!$K78,0)","v":104},{"$f":"ROUND(Advance_curve!$K79,0)","v":106},{"$f":"ROUND(Advance_curve!$K80,0)","v":108},null,":10E080005F00610063006400660068006A006C0065",null,"5F 61 63 64   66 68 6A 6C",null,1179,"49B","9B",100,101,"65"]
[16,"E0","90",224,144,{"$f":"ROUND(Advance_curve!$K81,0)","v":109},{"$f":"ROUND(Advance_curve!$K82,0)","v":111},{"$f":"ROUND(Advance_curve!$K83,0)","v":114},{"$f":"ROUND(Advance_curve!$K84,0)","v":118},{"$f":"ROUND(Advance_curve!$K85,0)","v":121},{"$f":"ROUND(Advance_curve!$K86,0)","v":124},{"$f":"ROUND(Advance_curve!$K87,0)","v":127},{"$f":"ROUND(Advance_curve!$K88,0)","v":129},null,":10E090006D006F007200760079007C007F008100C7",null,"6D 6F 72 76   79 7C 7F 81",null,1337,"539","39",198,199,"C7"]
[16,"E0","A0",224,160,{"$f":"ROUND(Advance_curve!$K89,0)","v":52},{"$f":"ROUND(Advance_curve!$K90,0)","v":53},{"$f":"ROUND(Advance_curve!$K91,0)","v":54},{"$f":"ROUND(Advance_curve!$K92,0)","v":55},{"$f":"ROUND(Advance_curve!$K93,0)","v":56},{"$f":"ROUND(Advance_curve!$K94,0)","v":57},{"$f":"ROUND(Advance_curve!$K95,0)","v":58},{"$f":"ROUND(Advance_curve!$K96,0)","v":59},null,":10E0A0003400350036003700380039003A003B00B4",null,"34 35 36 37   38 39 3A 3B",null,844,"34C","4C",179,180,"B4"]
[16,"E0","B0",224,176,{"$f":"ROUND(Advance_curve!K97,0)","v":60},{"$f":"ROUND(Advance_curve!K98,0)","v":61},{"$f":"ROUND(Advance_curve!K99,0)","v":62},{"$f":"ROUND(Advance_curve!K100,0)","v":63},{"$f":"ROUND(Advance_curve!K101,0)","v":63},{"$f":"ROUND(Advance_curve!K102,0)","v":64},{"$f":"ROUND(Advance_curve!K103,0)","v":66},{"$f":"ROUND(Advance_curve!K104,0)","v":73},null,":10E0B0003C003D003E003F003F0040004200490060",null,"3C 3D 3E 3F   3F 40 42 49",null,928,"3A0","A0",95,96,"60"]
[16,"E0","C0",224,192,{"$f":"ROUND(Advance_curve!$K105,0)","v":73},{"$f":"ROUND(Advance_curve!$K106,0)","v":74},{"$f":"ROUND(Advance_curve!$K107,0)","v":75},{"$f":"ROUND(Advance_curve!$K108,0)","v":75},{"$f":"ROUND(Advance_curve!$K109,0)","v":76},{"$f":"ROUND(Advance_curve!$K110,0)","v":77},{"$f":"ROUND(Advance_curve!$K111,0)","v":77},{"$f":"ROUND(Advance_curve!$K112,0)","v":78},null,":10E0C00049004A004B004B004C004D004D004E00F3",null,"49 4A 4B 4B   4C 4D 4D 4E",null,1037,"40D","0D",242,243,"F3"]
[16,"E0","D0",224,208,{"$f":"ROUND(Advance_curve!$K113,0)","v":79},{"$f":"ROUND(Advance_curve!$K114,0)","v":79},{"$f":"ROUND(Advance_curve!$K115,0)","v":80},{"$f":"ROUND(Advance_curve!$K116,0)","v":80},{"$f":"ROUND(Advance_curve!$K117,0)","v":81},{"$f":"ROUND(Advance_curve!$K118,0)","v":82},{"$f":"ROUND(Advance_curve!$K119,0)","v":82},{"$f":"ROUND(Advance_curve!$K120,0)","v":83},null,{"$f":"\":\"&DEC2HEX(A17,2)&B17&C17&\"00\"&DEC2HEX(F17,2)&\"00\"&DEC2HEX(G17,2)&\"00\"&DEC2HEX(H17,2)&\"00\"&DEC2HEX(I17,2)&\"00\"&DEC2HEX(J17,2)&\"00\"&DEC2HEX(K17,2)&\"00\"&DEC2HEX(L17,2)&\"00\"&DEC2HEX(M17,2)&\"00\"&X17","v":":10E0D0004F004F00500050005100520052005300BA"},null,{"$f":"DEC2HEX(F17,2)&\" \"&DEC2HEX(G17,2)&\" \"&DEC2HEX(H17,2)&\" \"&DEC2HEX(I17,2)&\"   \"&DEC2HEX(J17,2)&\" \"&DEC2HEX(K17,2)&\" \"&DEC2HEX(L17,2)&\" \"&DEC2HEX(M17,2)","v":"4F 4F 50 50   51 52 52 53"},null,1094,"446","46",185,186,"BA"]
[16,"E0","E0",224,224,{"$f":"ROUND(Advance_curve!$K121,0)","v":84},{"$f":"ROUND(Advance_curve!$K122,0)","v":84},{"$f":"ROUND(Advance_curve!$K123,0)","v":85},{"$f":"ROUND(Advance_curve!$K124,0)","v":86},{"$f":"ROUND(Advance_curve!$K125,0)","v":86},{"$f":"ROUND(Advance_curve!$K126,0)","v":87},{"$f":"ROUND(Advance_curve!$K127,0)","v":87},{"$f":"ROUND(Advance_curve!$K128,0)","v":88},null,":10E0E0005400540055005600560057005700580081",null,{"$f":"DEC2HEX(F18,2)&\" \"&DEC2HEX(G18,2)&\" \"&DEC2HEX(H18,2)&\" \"&DEC2HEX(I18,2)&\"   \"&DEC2HEX(J18,2)&\" \"&DEC2HEX(K18,2)&\" \"&DEC2HEX(L18,2)&\" \"&DEC2HEX(M18,2)","v":"54 54 55 56   56 57 57 58"},null,1151,"47F","7F",128,129,"81"]
[16,"E0","F0",224,240,{"$f":"ROUND(Advance_curve!$K129,0)","v":89},{"$f":"ROUND(Advance_curve!$K130,0)","v":89},{"$f":"ROUND(Advance_curve!$K131,0)","v":90},{"$f":"ROUND(Advance_curve!$K132,0)","v":91},{"$f":"ROUND(Advance_curve!$K133,0)","v":91},{"$f":"ROUND(Advance_curve!$K134,0)","v":92},{"$f":"ROUND(Advance_curve!$K135,0)","v":93},{"$f":"ROUND(Advance_curve!$K136,0)","v":93},null,":10E0F000590059005A005B005B005C005D005D0048",null,{"$f":"DEC2HEX(F19,2)&\" \"&DEC2HEX(G19,2)&\" \"&DEC2HEX(H19,2)&\" \"&DEC2HEX(I19,2)&\"   \"&DEC2HEX(J19,2)&\" \"&DEC2HEX(K19,2)&\" \"&DEC2HEX(L19,2)&\" \"&DEC2HEX(M19,2)","v":"59 59 5A 5B   5B 5C 5D 5D"},null,1208,"4B8","B8",71,72,"48"]
[16,"E1",{"$f":"DEC2HEX(E20,2)","v":"00"},225,0,{"$f":"ROUND(Advance_curve!$K137,0)","v":94},{"$f":"ROUND(Advance_curve!$K138,0)","v":95},{"$f":"ROUND(Advance_curve!$K139,0)","v":95},{"$f":"ROUND(Advance_curve!$K140,0)","v":96},{"$f":"ROUND(Advance_curve!$K141,0)","v":96},{"$f":"ROUND(Advance_curve!$K142,0)","v":97},{"$f":"ROUND(Advance_curve!$K143,0)","v":98},{"$f":"ROUND(Advance_curve!$K144,0)","v":98},null,":10E100005E005F005F00600060006100620062000E",null,"5E 5F 5F 60   60 61 62 62",null,1010,"3F2","F2",13,14,"0E"]
[16,"E1","10",225,16,{"$f":"ROUND(Advance_curve!$K145,0)","v":99},{"$f":"ROUND(Advance_curve!$K146,0)","v":100},{"$f":"ROUND(Advance_curve!$K147,0)","v":100},{"$f":"ROUND(Advance_curve!$K148,0)","v":101},{"$f":"ROUND(Advance_curve!$K149,0)","v":102},{"$f":"ROUND(Advance_curve!$K150,0)","v":102},{"$f":"ROUND(Advance_curve!$K151,0)","v":103},{"$f":"ROUND(Advance_curve!$K152,0)","v":104},null,":10E1100063006400640065006600660067006800D4",null,"63 64 64 65   66 66 67 68",null,1068,"42C","2C",211,212,"D4"]
[16,"E1","20",225,32,{"$f":"ROUND(Advance_curve!$K153,0)","v":104},{"$f":"ROUND(Advance_curve!$K154,0)","v":105},{"$f":"ROUND(Advance_curve!$K155,0)","v":105},{"$f":"ROUND(Advance_curve!$K156,0)","v":106},{"$f":"ROUND(Advance_curve!$K157,0)","v":107},{"$f":"ROUND(Advance_curve!$K158,0)","v":107},{"$f":"ROUND(Advance_curve!$K159,0)","v":108},{"$f":"ROUND(Advance_curve!$K160,0)","v":109},null,":10E120006800690069006A006B006B006C006D009C",null,"68 69 69 6A   6B 6B 6C 6D",null,1124,"464","64",155,156,"9C"]
[16,"E1","30",225,48,{"$f":"ROUND(Advance_curve!$K161,0)","v":109},{"$f":"ROUND(Advance_curve!$K162,0)","v":110},{"$f":"ROUND(Advance_curve!$K163,0)","v":111},{"$f":"ROUND(Advance_curve!$K164,0)","v":111},{"$f":"ROUND(Advance_curve!$K165,0)","v":112},{"$f":"ROUND(Advance_curve!$K166,0)","v":112},{"$f":"ROUND(Advance_curve!$K167,0)","v":113},{"$f":"ROUND(Advance_curve!$K168,0)","v":114},null,":10E130006D006E006F006F00700070007100720063",null,"6D 6E 6F 6F   70 70 71 72",null,1181,"49D","9D",98,99,"63"]
[16,"E1","40",225,64,0,0,0,0,0,0,0,0,null,":10E1400000000000000000000000000000000000CF",null,"00 00 00 00   00 00 00 00",null,305,"131","31",206,207,"CF"]
[16,"E1","50",225,80,0,0,0,0,0,0,0,0,null,":10E1500000000000000000000000000000000000BF",null,"00 00 00 00   00 00 00 00",null,321,"141","41",190,191,"BF"]
[16,"E1","60",225,96,0,0,0,0,0,0,0,0,null,":10E1600000000000000000000000000000000000AF",null,"00 00 00 00   00 00 00 00",null,337,"151","51",174,175,"AF"]
[16,"E1","70",225,112,0,0,0,0,0,0,0,0,null,":10E17000000000000000000000000000000000009F",null,"00 00 00 00   00 00 00 00",null,353,"161","61",158,159,"9F"]
[16,"E1","80",225,128,0,0,0,0,0,0,0,0,null,":10E18000000000000000000000000000000000008F",null,"00 00 00 00   00 00 00 00",null,369,"171","71",142,143,"8F"]
[16,"E1","90",225,144,0,0,0,0,0,0,0,0,null,":10E19000000000000000000000000000000000007F",null,"00 00 00 00   00 00 00 00",null,385,"181","81",126,127,"7F"]
[16,"E1","A0",225,160,0,0,0,0,0,0,0,0,null,":10E1A000000000000000000000000000000000006F",null,"00 00 00 00   00 00 00 00",null,401,"191","91",110,111,"6F"]
[16,"E1","B0",225,176,0,0,0,0,0,0,0,0,null,":10E1B000000000000000000000000000000000005F",null,"00 00 00 00   00 00 00 00",null,417,"1A1","A1",94,95,"5F"]
[16,"E1","C0",225,192,0,0,0,0,0,0,0,0,null,":10E1C000000000000000000000000000000000004F",null,{"$f":"DEC2HEX(F32,2)&\" \"&DEC2HEX(G32,2)&\" \"&DEC2HEX(H32,2)&\" \"&DEC2HEX(I32,2)&\"   \"&DEC2HEX(J32,2)&\" \"&DEC2HEX(K32,2)&\" \"&DEC2HEX(L32,2)&\" \"&DEC2HEX(M32,2)","v":"00 00 00 00   00 00 00 00"},null,{"$f":"SUM(A32,D32:M32)","v":433},"1B1","B1",78,79,"4F"]
[16,"E1","D0",225,208,{"$f":"Advance_curve!K1","v":79},{"$f":"Advance_curve!L1","v":25},{"$f":"Advance_curve!M1","v":1},0,0,0,0,0,null,{"$f":"\":\"&DEC2HEX(A33,2)&B33&C33&\"00\"&DEC2HEX(F33,2)&\"00\"&DEC2HEX(G33,2)&\"00\"&DEC2HEX(H33,2)&\"00\"&DEC2HEX(I33,2)&\"00\"&DEC2HEX(J33,2)&\"00\"&DEC2HEX(K33,2)&\"00\"&DEC2HEX(L33,2)&\"00\"&DEC2HEX(M33,2)&\"00\"&X33","v":":10E1D0004F001900010000000000000000000000D6"},null,{"$f":"DEC2HEX(F33,2)&\" \"&DEC2HEX(G33,2)&\" \"&DEC2HEX(H33,2)&\" \"&DEC2HEX(I33,2)&\"   \"&DEC2HEX(J33,2)&\" \"&DEC2HEX(K33,2)&\" \"&DEC2HEX(L33,2)&\" \"&DEC2HEX(M33,2)","v":"4F 19 01 00   00 00 00 00"},null,{"$f":"SUM(A33,D33:M33)","v":554},"22A","2A",213,214,"D6"]
[16,"E1","E0",225,224,{"$f":"Advance_curve!N44","v":160},0,{"$f":"Advance_curve!F5","v":50},{"$f":"Advance_curve!O42","v":1},200,{"$f":"Advance_curve!O40","v":1},{"$f":"Advance_curve!O38","v":1},{"$f":"Advance_curve!O36","v":0},null,":10E1E000A000000032000100C80001000100000092",null,{"$f":"DEC2HEX(F34,2)&\" \"&DEC2HEX(G34,2)&\" \"&DEC2HEX(H34,2)&\" \"&DEC2HEX(I34,2)&\"   \"&DEC2HEX(J34,2)&\" \"&DEC2HEX(K34,2)&\" \"&DEC2HEX(L34,2)&\" \"&DEC2HEX(M34,2)","v":"A0 00 32 01   C8 01 01 00"},null,{"$f":"SUM(A34,D34:M34)","v":878},"36E","6E",145,146,"92"]
[16,"E1","F0",225,240,{"$f":"LowRPM!I2","v":26},{"$f":"INT((Advance_curve!C4/Advance_curve!N30)*(60*1000000)/Advance_curve!N34/256)","v":23},{"$f":"IF(Advance_curve!N32=\"Auto\",99,Advance_curve!N32/ 500)","v":4},{"$f":"Advance_curve!N30","v":8},0,{"$f":"Advance_curve!K5","v":40},{"$f":"Advance_curve!B9","v":23},{"$f":"Advance_curve!C5","v":182},null,":10E1F0001A00170004000800000028001700B600ED",null,{"$f":"DEC2HEX(F35,2)&\" \"&DEC2HEX(G35,2)&\" \"&DEC2HEX(H35,2)&\" \"&DEC2HEX(I35,2)&\"   \"&DEC2HEX(J35,2)&\" \"&DEC2HEX(K35,2)&\" \"&DEC2HEX(L35,2)&\" \"&DEC2HEX(M35,2)","v":"1A 17 04 08   00 28 17 B6"},null,{"$f":"SUM(A35,D35:M35)","v":787},"313","13",236,237,"ED"]
[null,null,null,null,null,"End of File",null,null,null,null,null,null,null,null,":00000001FF"]
[]
[]
[]
[null,null,null,null,null,null,null,null,null,null,null,null,null,null,"The checksum value is the two's complement of the least significant byte (LSB) of the sum of all decoded byte values in the record that precede the checksum. "]
[null,null,null,null,null,null,null,null,null,null,null,null,null,null,"It is computed by summing the decoded byte values, extracting the LSB of the sum, and calculating the two's complement of the LSB"]
[null,null,null,null,null,null,null,null,null,null,null,null,null,null,"(e.g., by inverting its bits and adding one)."]
[null,null,null,null,null,null,null,null,null,null,null,null,null,null,"For example, in the case of the record :0300300002337A1E, the sum of the decoded byte values is 03 + 00 + 30 + 00 + 02 + 33 + 7A = E2."]
[null,null,null,null,null,null,null,null,null,null,null,null,null,null,"The two's complement of E2 is 1E, which is the checksum appearing at the end of the record."]
[]
[null,null,null,null,null,null,null,null,null,null,null,null,null,null,"Pour effectuer un complément à 2 il faut :"]
[null,null,null,null,null,null,null,null,null,null,null,null,null,null,"- Inverser tout les bits (1 en 0, 0 en 1) (ou faire 255-chiffre) pour faire le complement a 1"]
[null,null,null,null,null,null,null,null,null,null,null,null,null,null," puis ajouter 1 au résultat"]
[null,null,null,null,null,null,null,null,null,null,null,null,null,null,"Ex: DECHEX(255-SOMME(B3:K3)+1) = DECHEX(255+1-SOMME(B3:K3)) = DECHEX(256-SOMME(B3:K3))"]
[null,null,null,null,null,null,null,null,null,null,null,null,null,null,"le complement a 2 de 0 est egal a 0"]
[null,null,null,null,null,null,null,null,null,null,null,null,null,null,"Si 2 derniers chiffres de h100 = 00: cksum OK"]
[]
[null,null,null,null,null,null,null,null,null,null,null,null,null,null,"Méthode 1 (1er onglet)"]
[null,null,null,null,null,null,null,null,null,null,null,null,null,null,"C'est la méthode bestiale. On convertit le nombre (positif) en base 2, puis on inverse les bits et ensuite on ajoute 1 avec propagation d'une éventuelle retenue."]
[]
[null,null,null,null,null,null,null,null,null,null,null,null,null,null,"Méthode 2 (2ème onglet)"]
[null,null,null,null,null,null,null,null,null,null,null,null,null,null,"On utilise la formule suivante pour le complément à 2: Si X est le nombre négatif à convertir, la conversion de (2^16)-|X| en base 2 donne le résultat."]
[]
[]
[]
[]
[]
[]
[]
[]
[]
[]
[]
[]
[]
[]
[]
[null,":10E000001B"]
[null,":BBAAAATTHHHHHH.....HHHHCC"]
[null,"BB est le nombre d'octets de données dans la ligne (en hexadécimal)"]
[null,"AAAA est l'adresse absolue (ou relative) du début de la lign"]
[null,"TT est le champ spécifiant le type"]
[null,"HH...HHHH est le champ des données",null,null,null,null,null,null,null,"00, données, contient les données et l'adresse 16 bit."]
[null,"CC est l'octet de checksum. C'est le complément à deux de la somme des valeurs binaires des octets de tous les autres champs. (Les calculs sont faits sur 8 bits, en ignorant les retenues.)"]
[]
[null,"Pour vérifier la validité des données, il suffit de faire la somme de tous les octets représentés, à partir des deux-points jusqu'à la fin de ligne (checksum inclus: BB+AA+AA+TT+HH+...+CC): le résultat attendu est 0 (modulo 256)."]

{"sheet":"Accuracy","index":4,"n_rows":16,"n_cols":3,"rows_kept":16,"cut":false,"hidden":false,"merged":[]}
["CYLINDRE:",1,"cyl"]
["STROKES",2,"stk"]
["ACCURACY",3.4,"us"]
[]
["RPM","ERROR"]
[0,0]
[1000,{"$f":"$B$3/((1000*(60*$B$2)/(2*$B$1*$A7))/0.36)","v":2.0399999999999998E-2}]
[2000,4.0799999999999996E-2]
[3000,6.1199999999999997E-2]
[4000,8.1599999999999992E-2]
[5000,0.10199999999999999]
[6000,0.12239999999999999]
[7000,0.14279999999999998]
[8000,0.16319999999999998]
[9000,0.18359999999999999]
[10000,0.20399999999999999]

{"sheet":"formules","index":5,"n_rows":66,"n_cols":25,"rows_kept":66,"cut":false,"hidden":false,"merged":[[63,4,63,7],[63,8,63,11],[64,4,64,7],[64,8,64,11],[65,4,65,11],[0,10,0,11],[16,10,16,11],[16,13,16,14],[16,15,16,16],[17,15,17,16]]}
[null,null,null,null,"TEMPS","CYLINDRE","RPM","FREQUENCE","PERIODE","PERIODE","1°",null,"durée =","degrés","relatif\npickup"]
[null,null,null,null,"Nbr","Nbr","tr/mn","Hz","ms","pour 2cyl 2tps","ms","us","us",null,{"$f":"Advance_curve!F5","v":50},null,null,null,null,null,null,null,"4 stk:"]
[null,null,null,null,2,1,9000,{"$f":"(2*$F$3*$G$3)/(60*$E$3)","v":150},{"$f":"1000*(60*$E$3)/(2*$F$3*$G$3)","v":6.666666666666667},{"$f":"1000*60/$G$3","v":6.666666666666667},{"$f":"I3/360","v":1.8518518518518521E-2},{"$f":"I3/0.36","v":18.518518518518519},64000,{"$f":"M3/L3","v":3456},{"$f":"Advance_curve!F5-N3","v":-3406},null,null,null,null,null,null,null,"1 cyl","1/2 spark every rotation","720°"]
[null,null,null,null,null,null,null,null,{"$f":"1000*I3","v":6666.666666666667},null,null,null,null,null,null,null,null,null,null,null,null,null,"2 cyl","1 spark every rotation","360°"]
[null,null,null,null,null,null,{"$f":"(60*$H$5*$E$3)/(2*$F$3)","v":120},2,{"$f":"1000*(60*$E$3)/(2*$F$3*$G$5)","v":500},{"$f":"1000*60/$G$5","v":500},{"$f":"I5/360","v":1.3888888888888888},{"$f":"I5/0.36","v":1388.8888888888889},null,"FRQ = (2*CYL*RPM) / (60*TEMPS)",null,null,null,null,null,null,null,null,"3 cyl","1,5 spark every rotation","240°"]
[null,null,null,null,null,null,null,null,null,null,null,null,null,"RPM = (60*FRQ*TEMPS) / ( 2*CYL)",null,null,null,null,null,null,null,null,"4 cyl","2 sparks every rotation","180°"]
[null,null,null,null,null,null,"Délai","=>","Délai","Avance",null,null,null,"1degré = (1000*1000*60*CYL) / ( 2*TEMPS*RPM)/360",null,null,null,null,null,null,null,null,"5 cyl","2,5 sparks every rotation","144°"]
[null,null,null,null,null,null,"us",null,"°","°",null,null,null,"RPM= 60*1000000/ TMR1*256*presc/Fosc",null,null,null,null,null,null,null,null,"6 cyl","3 sparks every rotation","120°"]
[null,null,null,null,null,null,9600,null,{"$f":"G9/L3","v":518.4},{"$f":"Advance_curve!F5 -I9","v":-468.4},null,null,null,"TMR1=(PER*Fosc)/ presc*255",null,null,null,null,null,null,null,null,"10 cyl","5 sparks every rotation","72°"]
[null,null,null,null,null,null,null,null,null,null,null,null,null,"FRQ = 1/TMR1H = 1/TMR1H * (255 * PRES/Fosc) = 1*1000000 / TMR1H* (255 * PRES/Fosc) ",null,null,null,null,null,null,null,null,"12 cyl","6 sparks every rotation","60°"]
[2.5,null,null,null,null,null,"Frequence","=>","RPM","PERIODE"]
[null,null,null,null,null,null,11,"Hz",{"$f":"60*G12*$E$3/2*$F$3","v":660},{"$f":"1000/G12","v":90.909090909090907},"ms"]
[]
[null,null,null,null,null,null,"Periode","=>","RPM","FRQ",null,null,null,null,null,null,null,null,"2 stk = 1 sprk per rev."]
[null,null,null,null,null,null,11,"ms",{"$f":"60*(1000/G15)*$E$3/2*$F$3","v":5454.545454545454},{"$f":"1000/G15","v":90.909090909090907},"Hz",null,null,null,null,null,null,null,"4 stk = 1 sprk per 2 rev."]
[null,null,null,null,null,null,null,null,null,null,null,null,null,null,null,null,null,null,"At 1000 rpm, 2stk = 1000 sparks/mn = 1000/60sec = 16Hz"]
[null,"Clock","Fosc","Multiplier","Delay","Prescaler","Nombre de","Nombre","Fréquence","Régime","Période",null,"TIMER1","Delay of:",null,{"$f":"IF(Q20>0,\"Avance\",\"RETARD\")","v":"RETARD"},null,null,"At 1000 rpm, 4stk = 500 sparks/mn = 500/60sec = 8Hz"]
[null,null,null,null,null,null,"Cylindres","de temps",null,null,null,null,"high",null,null,"BTDC",null,null,null,"Then to multiply but the number of cylinders"]
[null,"MHz","MHz",null,"us",null,null,null,"Hz","tr/mn","ms","µs",{"$f":"IF(M20>127,\"erreur\",\"\")","v":""},"µs","ms","ms","degrees",null,null,"2 stk x 1cyl = 16Hz"]
[null,{"$f":"Advance_curve!C3","v":16},{"$f":"Advance_curve!C4","v":4},8,20,{"$f":"Advance_curve!N30","v":8},{"$f":"F3","v":1},{"$f":"E3","v":2},{"$f":"H3","v":150},{"$f":"(60*I20*H20)/(2*G20)","v":9000},{"$f":"1000/I20","v":6.666666666666667},{"$f":"1000000/I20","v":6666.666666666667},{"$f":"INT(L20*C20/($F$20*255))","v":13},{"$f":"($E$20 *$M$20*$D$20)","v":2080},{"$f":"N20/1000","v":2.08},{"$f":"(K20/360)*Advance_curve!F5 - O20","v":-1.154074074074074},{"$f":"(360/K20)*P20","v":-62.32},null,null,"2 stk x 2cyl = 30hz"]
[]
[]
[]
[null,null,null,"http://syskb.com/creer-une-liste-deroulante-dans-excel-2010/",null,null,null,null,null,null,null,null,null,null,null,"DUREE",null,null,"F = (P/2)(N/60) => F=P*N/120"]
[null,null,null,null,null,null,null,null,null,null,null,null,null,null,null,"us",null,null,"N: rpm"]
[null,null,null,"TIMER 0","8bits",null,null,null,null,"Timer1","16bits = 65535 max",null,null,null,null,300]
[null,null,null,"Quartz a 4MHz",null,null,null,null,null,"Quartz a 4MHz",null,null,null,null,null,null,null,null,"Tension produite:"]
[null,null,null,"4 cycles d'horloge par operation: Fosc/4 or 4MHz/4 = 1MHz",null,null,null,null,null,"4 cycles d'horloge par operation: Fosc/4 or 4MHz/4 = 1MHz",null,null,null,null,null,null,null,null,"Erms=(K * ω * N * θ ) / √2"]
[null,null,null,"- Prescaler sur 256 dans le registre T0CON",null,null,null,null,null,"- Prescaler sur 8 dans le registre T1CON",null,null,null,null,null,null,null,null,"Erms=4,44 * K * F * N * θ"]
[null,null,null,"- period of the frequency input to Timer 0 :",null,null,null,null,null,"- period of the frequency input to Timer 1 : (toutes les 8us , TMR1 avance d'un cran)"]
[null,null,null,"1/(1MHz/256) = 256us",null,null,null,null,null,"1/(1MHz/8) = 8us",null,null,null,null,null,null,null,null,"Courant produit:"]
[null,null,null,"This is the period of time for each count in Timer 0 i.e.",null,null,null,null,null,"This is the period of time for each count in Timer 1 i.e.",null,null,null,null,null,null,null,null,"I = (θ * N) / L"]
[null,null,null,"256 * 256us = 65536us = 65.636ms = 15.26Hz",null,null,null,null,null,"65536 * 8us = 525ms = 1,9Hz"]
[]
[null,null,null,"Lorsque TMR0=10, il s'est écoulé 10x256us = 2560us = 2,6ms.",null,null,null,null,null,"PRESC=1 => TMR1L s'incrémente de 1 en 1us jusqu'a 255. TMR1H s'incremente de 1 en 256us,  deborde toutes les 65ms"]
[null,null,null,"Si entre temps le moteur a fait 1 tour, c'est qu'il tourne a 2,56ms par tour",null,null,null,null,null,"PRESC=2 => TMR1L s'incrémente de 1 en 2us jusqu'a 255. TMR1H s'incremente de 1 en 512us,  deborde ici toutes les 131ms"]
[null,null,null,"pour trouver des tours/mn: en 1mn (soit 60sec * 1000 = 60000ms)",null,null,null,null,null,"PRESC=4 => TMR1L s'incrémente de 1 en 4us jusqu'a 255. TMR1H s'incremente de 1 en 1024us, deborde ici toutes les 262ms"]
[null,null,null,"60000/2,56 = 23437 RPM",null,null,null,null,null,"PRESC=8 => TMR1L s'incrémente de 1 en 8us jusqu'a 255. TMR1H s'incremente de 1 en 2048us, deborde ici toutes les 525ms"]
[]
[]
[null,null,null,null,null,null,null,null,null,"Quartz a 16MHz"]
[null,null,null,null,null,null,null,null,null,"4 cycles d'horloge par operation: Fosc/4 or 16MHz/4 = 4MHz"]
[null,null,null,null,null,null,null,null,null,"- Prescaler sur 8 dans le registre T1CON",null,null,"(arrivé a 16bits 65535, TMR1 déborde et provoque INT)"]
[null,null,null,null,null,null,null,null,null,"- period of the frequency input to Timer 1 : (toutes les 2us , TMR1 avance d'un cran)"]
[null,null,null,null,null,null,null,null,null,"1/(4MHz/8) = 2us"]
[null,null,null,null,null,null,null,null,null,"This is the period of time for each count in Timer 1 i.e."]
[null,null,null,null,null,null,null,null,null,"65536 * 2us = 131ms = 7,6Hz"]
[]
[null,null,null,null,null,null,null,null,null,"PRESC=1 => TMR1L s'incrémente de 1 en 0.25us jusqu'a 255. TMR1H s'incrémente de 1 en  64us et déborde en 16ms"]
[null,null,null,null,null,null,null,null,null,"PRESC=2 => TMR1L s'incrémente de 1 en 0.5us jusqu'a 255. TMR1H s'incrémente de 1 en 128us et déborde en 32ms <==="]
[null,null,null,null,null,null,null,null,null,"PRESC=4 => TMR1L s'incrémente de 1 en 1us jusqu'a 255. TMR1H s'incrémente de 1 en 256us et déborde en 65ms"]
[null,null,null,null,null,null,null,null,null,"PRESC=8 => TMR1L s'incrémente de 1 en 2us jusqu'a 255. TMR1H s'incrémente de 1 en 512us et déborde en 131ms"]
[]
[null,null,null,null,null,null,null,null,null,"Calculator:"]
[null,null,null,null,null,null,null,null,null,"http://eng-serve.com/pic/pic_timer.html"]
[null,null,null,"Conversion BIN to HEX:"]
[]
[null,null,null,"Position",8,7,6,5,4,3,2,1]
[null,null,null,"numero",7,6,5,4,3,2,1,0]
[null,null,null,"Puissance","2^3","2^2","2^1","2^0","2^3","2^2","2^1","2^0"]
[null,null,null,"Valeur 2x4bits",8,4,2,1,8,4,2,1]
[null,null,null,"Binaire",0,1,1,0,1,0,1,1]
[null,null,null,"Valeur",{"$f":"E62*E61","v":0},4,2,0,8,0,2,1]
[null,null,null,"2x4bits",{"$f":"E63+F63+G63+H63","v":6},null,null,null,{"$f":"I63+J63+K63+L63","v":11}]
[null,null,null,"Hexa 2x4bits",{"$f":"DEC2HEX(E64)","v":"6"},null,null,null,{"$f":"DEC2HEX(I64)","v":"B"}]
[null,null,null,"Hexa",{"$f":"CONCATENATE(E65,I65)","v":"6B"}]

{"sheet":"Calculs","index":6,"n_rows":39,"n_cols":6,"rows_kept":39,"cut":false,"hidden":false,"merged":[]}
[]
["- Tant que pickup est bas (=0) 99% du temps, on met la valeur du TIMER0 dans la variable PERL (PERiode Low)"]
["- Chaque fois que TIMER0 provoque une INTerruption de debordement lorsqu'il arrive a 255,  dans la routine d'interruption on incremente TMR0H (TIMER0 High)"]
["- Quand le pickup est haut (=1) (pulse) :"]
["- on memorise la valeur de TMR0H (Nbr de debordements de TIMER0), dans PERH (PERiode High)"]
["- et on memorise aussi la valeur du TIMER0 dans la variable PERL."]
["- puis on RAZ les timers,"]
[]
["- Ainsi la durée ecoulé entre 2 pickups est stockée dans PERL et PERH.   Soit : (PERH x 255 ) + PERL"]
[]
["Avec Q=4MHz, Prescaler = 256 et Preset = 0"]
["TIMER0 s'incremente toutes les 256us et deborde toutes les 256x256= 65536us = 65,5ms = 15,25Hz"]
["(utiliser: E:\\Pic\\Exemples\\pic_calculations.xls)"]
["- donc [ (PERH * 255 ) + PERL ] * 65,5ms = durée entre 2 pulses."]
[]
["- Dans le soft:"]
["- on regarde si PERH est > a une certaine valeur, auquel cas le moteur tourne très lentement"]
["- on regarde si PERL est < a une certaine valeur, auquel cas le moteur tourne trop vite => arret des sparks pour limiter le regime"]
["- on regarde si PERL est < a une certaine valeur, auquel cas le moteur tourne très vite => spark immediat (sans avance)"]
["- entre ces 2 limites, on lit un tableau qui retourne un chiffre (delay) pour chacune des 95 valeurs de PERL"]
["- ce DELAY est le temps d'attente (nbr de boucles d'atttente) avant d'envoyer le spark"]
[]
["Propriete de l'interruption:"]
[]
[]
[null,null,null,null,null,"Liste deroulante"]
[null,null,null,null,null,"selectionner la cellule "]
[null,null,null,null,null,"donnees> validité des données> validite des donnees > afficher: liste"]
[]
[]
[]
[]
[]
[]
[]
[]
[]
["Quand 4MHZ, a 15,4Hz = 924RPM, il faut 64935us pour faire un tour, donc TIMER0 a le temps d'aller jusqu’à 254 et de presque deborder:"]
["Quand 16MHZ, a 15,4Hz = 924RPM, il faut 64935us pour faire un tour, donc TIMER1-High (les débords de TMR1) a le temps d'aller jusqu’à 127"]

{"sheet":"Dwell variable","index":7,"n_rows":98,"n_cols":5,"rows_kept":98,"cut":false,"hidden":false,"merged":[]}
[]
[null,null,null,"coef:","DWELL = PERIODE * 50"]
[null,{"$f":"Advance_curve!B8","v":"TIMER1H count"},null,50]
[null,{"$f":"Advance_curve!B9","v":23},{"$f":"$D$3*Advance_curve!B9","v":1150},"µs"]
[null,{"$f":"Advance_curve!B10","v":24},{"$f":"$D$3*Advance_curve!B10","v":1200}]
[null,{"$f":"Advance_curve!B11","v":25},{"$f":"$D$3*Advance_curve!B11","v":1250}]
[null,{"$f":"Advance_curve!B12","v":26},{"$f":"$D$3*Advance_curve!B12","v":1300}]
[null,{"$f":"Advance_curve!B13","v":27},{"$f":"$D$3*Advance_curve!B13","v":1350}]
[null,{"$f":"Advance_curve!B14","v":28},{"$f":"$D$3*Advance_curve!B14","v":1400}]
[null,{"$f":"Advance_curve!B15","v":29},{"$f":"$D$3*Advance_curve!B15","v":1450}]
[null,{"$f":"Advance_curve!B16","v":30},{"$f":"$D$3*Advance_curve!B16","v":1500}]
[null,{"$f":"Advance_curve!B17","v":31},{"$f":"$D$3*Advance_curve!B17","v":1550}]
[null,{"$f":"Advance_curve!B18","v":32},{"$f":"$D$3*Advance_curve!B18","v":1600}]
[null,{"$f":"Advance_curve!B19","v":33},{"$f":"$D$3*Advance_curve!B19","v":1650}]
[null,{"$f":"Advance_curve!B20","v":34},{"$f":"$D$3*Advance_curve!B20","v":1700}]
[null,{"$f":"Advance_curve!B21","v":35},{"$f":"$D$3*Advance_curve!B21","v":1750}]
[null,{"$f":"Advance_curve!B22","v":36},{"$f":"$D$3*Advance_curve!B22","v":1800}]
[null,{"$f":"Advance_curve!B23","v":37},{"$f":"$D$3*Advance_curve!B23","v":1850}]
[null,{"$f":"Advance_curve!B24","v":38},{"$f":"$D$3*Advance_curve!B24","v":1900}]
[null,{"$f":"Advance_curve!B25","v":39},{"$f":"$D$3*Advance_curve!B25","v":1950}]
[null,{"$f":"Advance_curve!B26","v":40},{"$f":"$D$3*Advance_curve!B26","v":2000}]
[null,{"$f":"Advance_curve!B27","v":41},{"$f":"$D$3*Advance_curve!B27","v":2050}]
[null,{"$f":"Advance_curve!B28","v":42},{"$f":"$D$3*Advance_curve!B28","v":2100}]
[null,{"$f":"Advance_curve!B29","v":43},{"$f":"$D$3*Advance_curve!B29","v":2150}]
[null,{"$f":"Advance_curve!B30","v":44},{"$f":"$D$3*Advance_curve!B30","v":2200}]
[null,{"$f":"Advance_curve!B31","v":45},{"$f":"$D$3*Advance_curve!B31","v":2250}]
[null,{"$f":"Advance_curve!B32","v":46},{"$f":"$D$3*Advance_curve!B32","v":2300}]
[null,{"$f":"Advance_curve!B33","v":47},{"$f":"$D$3*Advance_curve!B33","v":2350}]
[null,{"$f":"Advance_curve!B34","v":48},{"$f":"$D$3*Advance_curve!B34","v":2400}]
[null,{"$f":"Advance_curve!B35","v":49},{"$f":"$D$3*Advance_curve!B35","v":2450}]
[null,{"$f":"Advance_curve!B36","v":50},{"$f":"$D$3*Advance_curve!B36","v":2500}]
[null,{"$f":"Advance_curve!B37","v":51},{"$f":"$D$3*Advance_curve!B37","v":2550}]
[null,{"$f":"Advance_curve!B38","v":52},{"$f":"$D$3*Advance_curve!B38","v":2600}]
[null,{"$f":"Advance_curve!B39","v":53},{"$f":"$D$3*Advance_curve!B39","v":2650}]
[null,{"$f":"Advance_curve!B40","v":54},{"$f":"$D$3*Advance_curve!B40","v":2700}]
[null,{"$f":"Advance_curve!B41","v":55},{"$f":"$D$3*Advance_curve!B41","v":2750}]
[null,{"$f":"Advance_curve!B42","v":56},{"$f":"$D$3*Advance_curve!B42","v":2800}]
[null,{"$f":"Advance_curve!B43","v":57},{"$f":"$D$3*Advance_curve!B43","v":2850}]
[null,{"$f":"Advance_curve!B44","v":58},{"$f":"$D$3*Advance_curve!B44","v":2900}]
[null,{"$f":"Advance_curve!B45","v":59},{"$f":"$D$3*Advance_curve!B45","v":2950}]
[null,{"$f":"Advance_curve!B46","v":60},{"$f":"$D$3*Advance_curve!B46","v":3000}]
[null,{"$f":"Advance_curve!B47","v":61},{"$f":"$D$3*Advance_curve!B47","v":3050}]
[null,{"$f":"Advance_curve!B48","v":62},{"$f":"$D$3*Advance_curve!B48","v":3100}]
[null,{"$f":"Advance_curve!B49","v":63},{"$f":"$D$3*Advance_curve!B49","v":3150}]
[null,{"$f":"Advance_curve!B50","v":64},{"$f":"$D$3*Advance_curve!B50","v":3200}]
[null,{"$f":"Advance_curve!B51","v":65},{"$f":"$D$3*Advance_curve!B51","v":3250}]
[null,{"$f":"Advance_curve!B52","v":66},{"$f":"$D$3*Advance_curve!B52","v":3300}]
[null,{"$f":"Advance_curve!B53","v":67},{"$f":"$D$3*Advance_curve!B53","v":3350}]
[null,{"$f":"Advance_curve!B54","v":68},{"$f":"$D$3*Advance_curve!B54","v":3400}]
[null,{"$f":"Advance_curve!B55","v":69},{"$f":"$D$3*Advance_curve!B55","v":3450}]
[null,{"$f":"Advance_curve!B56","v":70},{"$f":"$D$3*Advance_curve!B56","v":3500}]
[null,{"$f":"Advance_curve!B57","v":71},{"$f":"$D$3*Advance_curve!B57","v":3550}]
[null,{"$f":"Advance_curve!B58","v":72},{"$f":"$D$3*Advance_curve!B58","v":3600}]
[null,{"$f":"Advance_curve!B59","v":73},{"$f":"$D$3*Advance_curve!B59","v":3650}]
[null,{"$f":"Advance_curve!B60","v":74},{"$f":"$D$3*Advance_curve!B60","v":3700}]
[null,{"$f":"Advance_curve!B61","v":75},{"$f":"$D$3*Advance_curve!B61","v":3750}]
[null,{"$f":"Advance_curve!B62","v":76},{"$f":"$D$3*Advance_curve!B62","v":3800}]
[null,{"$f":"Advance_curve!B63","v":77},{"$f":"$D$3*Advance_curve!B63","v":3850}]
[null,{"$f":"Advance_curve!B64","v":78},{"$f":"$D$3*Advance_curve!B64","v":3900}]
[null,{"$f":"Advance_curve!B65","v":79},{"$f":"$D$3*Advance_curve!B65","v":3950}]
[null,{"$f":"Advance_curve!B66","v":80},{"$f":"$D$3*Advance_curve!B66","v":4000}]
[null,{"$f":"Advance_curve!B67","v":81},{"$f":"$D$3*Advance_curve!B67","v":4050}]
[null,{"$f":"Advance_curve!B68","v":82},{"$f":"$D$3*Advance_curve!B68","v":4100}]
[null,{"$f":"Advance_curve!B69","v":83},{"$f":"$D$3*Advance_curve!B69","v":4150}]
[null,{"$f":"Advance_curve!B70","v":84},{"$f":"$D$3*Advance_curve!B70","v":4200}]
[null,{"$f":"Advance_curve!B71","v":85},{"$f":"$D$3*Advance_curve!B71","v":4250}]
[null,{"$f":"Advance_curve!B72","v":86},{"$f":"$D$3*Advance_curve!B72","v":4300}]
[null,{"$f":"Advance_curve!B73","v":87},{"$f":"$D$3*Advance_curve!B73","v":4350}]
[null,{"$f":"Advance_curve!B74","v":88},{"$f":"$D$3*Advance_curve!B74","v":4400}]
[null,{"$f":"Advance_curve!B75","v":89},{"$f":"$D$3*Advance_curve!B75","v":4450}]
[null,{"$f":"Advance_curve!B76","v":90},{"$f":"$D$3*Advance_curve!B76","v":4500}]
[null,{"$f":"Advance_curve!B77","v":91},{"$f":"$D$3*Advance_curve!B77","v":4550}]
[null,{"$f":"Advance_curve!B78","v":92},{"$f":"$D$3*Advance_curve!B78","v":4600}]
[null,{"$f":"Advance_curve!B79","v":93},{"$f":"$D$3*Advance_curve!B79","v":4650}]
[null,{"$f":"Advance_curve!B80","v":94},{"$f":"$D$3*Advance_curve!B80","v":4700}]
[null,{"$f":"Advance_curve!B81","v":95},{"$f":"$D$3*Advance_curve!B81","v":4750}]
[null,{"$f":"Advance_curve!B82","v":96},{"$f":"$D$3*Advance_curve!B82","v":4800}]
[null,{"$f":"Advance_curve!B83","v":97},{"$f":"$D$3*Advance_curve!B83","v":4850}]
[null,{"$f":"Advance_curve!B84","v":98},{"$f":"$D$3*Advance_curve!B84","v":4900}]
[null,{"$f":"Advance_curve!B85","v":99},{"$f":"$D$3*Advance_curve!B85","v":4950}]
[null,{"$f":"Advance_curve!B86","v":100},{"$f":"$D$3*Advance_curve!B86","v":5000}]
[null,{"$f":"Advance_curve!B87","v":101},{"$f":"$D$3*Advance_curve!B87","v":5050}]
[null,{"$f":"Advance_curve!B88","v":102},{"$f":"$D$3*Advance_curve!B88","v":5100}]
[null,{"$f":"Advance_curve!B89","v":103},{"$f":"$D$3*Advance_curve!B89","v":5150}]
[null,{"$f":"Advance_curve!B90","v":104},{"$f":"$D$3*Advance_curve!B90","v":5200}]
[null,{"$f":"Advance_curve!B91","v":105},{"$f":"$D$3*Advance_curve!B91","v":5250}]
[null,{"$f":"Advance_curve!B92","v":106},{"$f":"$D$3*Advance_curve!B92","v":5300}]
[null,{"$f":"Advance_curve!B93","v":107},{"$f":"$D$3*Advance_curve!B93","v":5350}]
[null,{"$f":"Advance_curve!B94","v":108},{"$f":"$D$3*Advance_curve!B94","v":5400}]
[null,{"$f":"Advance_curve!B95","v":109},{"$f":"$D$3*Advance_curve!B95","v":5450}]
[null,{"$f":"Advance_curve!B96","v":110},{"$f":"$D$3*Advance_curve!B96","v":5500}]
[null,{"$f":"Advance_curve!B97","v":111},{"$f":"$D$3*Advance_curve!B97","v":5550}]
[null,{"$f":"Advance_curve!B98","v":112},{"$f":"$D$3*Advance_curve!B98","v":5600}]
[null,{"$f":"Advance_curve!B99","v":113},{"$f":"$D$3*Advance_curve!B99","v":5650}]
[null,{"$f":"Advance_curve!B100","v":114},{"$f":"$D$3*Advance_curve!B100","v":5700}]
[null,{"$f":"Advance_curve!B101","v":115},{"$f":"$D$3*Advance_curve!B101","v":5750}]
[null,{"$f":"Advance_curve!B102","v":116},{"$f":"$D$3*Advance_curve!B102","v":5800}]
[null,{"$f":"Advance_curve!B103","v":117},{"$f":"$D$3*Advance_curve!B103","v":5850}]

{"sheet":"Version","index":8,"n_rows":73,"n_cols":2,"rows_kept":73,"cut":false,"hidden":false,"merged":[]}
[]
["v7.9r13c2","[HARD] Correction RA1 forcé a 1, car pullup R5 sur PCB"]
["v7.9r13c3","[XLS] Valeur de dwell passe de 2 choix (500,1000) a 6 choix (500,1000,2000,3000,4000,5000)."]
["v7.9r14c0","[SOFT,XLS] Ajout d'une valeur de dwell \"AUTO\" pour lequel la durée de dwell est proportionnelle a PERIODE."]
["v7.9r14c1","[SOFT] Code protection OFF"]
["v7.9r15c0","[XLS] La valeur d'avance affichée dans l'onglet \"advance_at_lowRPM\" ne prenait pas en compte la position du pickup, c'était donc une valeur RELATIVE, pas ABSOLUE. Multiplicateur peut descendre a 1 (soft OK)"]
[null,"[SOFT] si JP2 a la masse alors PIC bypass la courbe d'avance et envoi spark dés que detection front descendant du pickup"]
[null,"[SOFT] RB3 (ex TP2) n'était pas forcé en OUTPUT"]
[null,"[HARD] Suppression TP2 inutile"]
[null,"[HARD] Reduction R7 de 330 a 180 (Sinon ne declenche pas les SCR de type BTA)."]
[null,"[HARD] Suppression C9-100n car courant d'appel dépasse Imax du PIC"]
["v7.9r16c0","[XLS] La valeur d'avance affichée dans l'onglet \"advance_at_lowRPM\" était fausse."]
[null,"[SOFT] boucles d'attente pkp haut et bas en ASM: Precision x10 !!"]
[null,"[XLS] Ajout documentation onglet README"]
["v7.9r16c1","[XLS] Tuning: a low RPM, le PIC attend 4us x PERIODE mais en vrai bcl dure plus de 4us, du coup il y a un offset de 5deg (20° affiché et 15° reels)\npour simplifier correction: la valeur delay (I1) passe de 4 a 4.4"]
[null,"[SOFT] Calibration de la boucle 40us"]
["v7.9r17c0","[XLS] Ajout d'un Rev Limiter a l'adresse Eprom 121 si swich JP2 a la masse"]
[null,"[SOFT] JP2 (ex Bypass curve) est utilisé pour activer une limitation de RPM inferieur au maxi et stocké en @121 de l'eprom (Scooter légal)"]
["v7.9r17c1","[XLS] Renommage en accord avec code. Ajout RPM mini dans le titre onglet low_rpm"]
["v7.9r18c0","[XLS] Ajout d'un délai at Kick Start selectionnable par le user"]
[null,"[SOFT] Si TMR1 déborde, PIC attend une pause d'une durée fixe VLRPM qui a été définie par le user et écrite en eprom. Sinon spark immediate entre 0 et 480RPM car TMR1 = 0 = croit que RPM élévés"]
["v7.9r19c0","[XLS] Ajout step 200us permet de positionner le pkp jusqu’à 360° btdc"]
[null,"[SOFT] Ajout step 200us permet de positionner le pkp jusqu’à 360° btdc"]
[null,"[SOFT] Si TMR1 déborde, PIC attend une pause de Nbr débordements * VLRPM qui a été définie par le user et écrite en eprom. Sinon spark immediate entre 0 et 480RPM car TMR1 = 0 = croit que RPM élévés"]
["v7.9r20c0","[SOFT] Suppresion JP1: autospark et RB3 output PWM"]
[null,"[SOFT] RB3 devient RevCoil, RB5 devient sortie Tacho, meme signal que RA2"]
[null,"[SOFT] Lecture de JP2 (rev limit) dés que pkp repasse a 1, donc possible de changer rpm limit pendant la marche"]
[null,"[XLS] Modif commentaire dwell, Renommage en ACCDI_v79r20c0 (au lieu curve_adjust_16f628_xxxx)"]
[null,"[XLS] Ajout onglet EPROM16 pour configurer 16F628 directement avec pickit3 sans besoin de icprog"]
[null,"[HARD] option tachometer avec PIC 12F629"]
["v7.9r20c1","[XLS] Modif choix 2,4 stk wasted spark"]
[null,"[XLS] Correction. Le temps en us pour 1° changeait selon 2 ou 4tps ! (faux en 4)"]
[null,"[XLS] Portage sur 16F1827: reduction temps incompressible de 71 a 18us"]
["v7.9r20c2","[XLS] renommage en v79r20c1 avec suffixe 16F1847"]
[null,"[XLS] remplacement onglet EEPROM8 par EEPROM16"]
[null,"[XLS] Augmentation du nombre de trial de 20 a 50"]
[null,"[XLS] Ajout d'une cellule C11 dans VLRPM pour ajuster l'avance a ces regimes"]
[null,"[XLS] Modif 4MHz dans VLRPM"]
["v7.9r21c0","[SOFT] utilisation de INT sur RB4"]
[null,"[XLS] pas de modification"]
["v7.9r21c1","[XLS] correction du nbr de debord max de TMR1 (40/prescaler au lieu de 5 fixe)"]
["v7.9r21c2","[XLS] Le hash calculé dans Eeprom16 ne sert a rien avec PICkit3 qui ne le lit pas. Mais MPASM le lirait…"]
[null,"[XLS] Correction du Hash, il fallait additionner toute la ligne donc aussi 10h=16d qui est le nbr de bits"]
[null,"[XLS] Correction dans eeprom16 , arrondi de valeur eeprom sinon affichage arrondi mais valeur decimal du coup checksum faux car somme fausse"]
[null,"[XLS] Correction du hash, il n'y avait pas besoin de corriger la valeur de checksum"]
[null,"[SOFT] Free trial passe de 50 a 200, Ne clignote plus"]
[null,"[XLS] Free trial passe de 50 a 200"]
[null,"[XLS] macro VLRPM utilise clock de advance_curve"]
["v7.9r21c3","[XLS] ERROR N°1: La derniere ligne de \"advance curve\" a TMR1max correspond par ex a 123 = 950rpm/16Hz/62ms mais en vrai le PIC n'arrive ici qu'a 32Hz/31ms"]
[null,"car 16F1827 a 16MHz compte + vite et PERIODE arrive a 123 en 31ms (et pas en 62ms): Correction calcul RPM dans advance_curve"]
[null,"ERROR N°2: dans adv_low_rpm a 10Hz/600rpm il est censé y avoir délai: 10ms mais 50ms en vrai !!"]
[null,"Correction dans le calcul de la valeur de TMR1h qui ne tenait pas compte de la clock!"]
[null,"[XLS] Selection nbr d'aimants sur rotor 1 or 2. Si 2 aimants on ignore la 2em pulse (desactivé)"]
["v7.9r22c0","[SOFT] 16F1827 a plus de RAM que 16F628 : Augmentation de 96 (max pour 1 variable) a 2x80 valeurs d'avance en RAM (max pour 2 variables)"]
[null,"[XLS] 16F1827 a plus de RAM que 16F628 : Augmentation de 96 a 2x80 valeurs d'avance en RAM (onglets: eeprom16, adv_low_rpm, adv_curve,calcul,formule)"]
[null,"[XLS] Ajout cell M40 pour ajuster le RPM de bascule de l'onglet \"adv_curve\" a \"adv_low_rpm\" en cas de warning "]
[null,"[XLS] Correction limitation de RPM par JP2 (ne fonctionnait plus depuis 16F1827)"]
[null,"[XLS] activation choix LED au départ.  Ajout choix d'attendre un 1er tour moteur pour mesurer RPM ou pas"]
[null,"[XLS] correction: il fallait soustraire l'hysteresis plus 200us de délai entre détection pickup et debut compte a rebours"]
[null,"[SOFT] Calibration des boucles 20, 40us"]
[null,"[SOFT,XLS] Suppression du choix délai 200us inutile"]
["v7.9r23c1","[SOFT,XLS] pour les 80 premieres valeurs d'avance RETARDL[] le step est selectionnable par user 20,40,100 mais pour valeurs RPM faible (RETARDH) c'est forcé a 100us pour eviter warning en haut et en bas"]
[null,"[XLS] Correction, la colonne FRQ devait etre calculée d'apres TMR1 et non d'apres RPM. Maintenant c'est logique si on change 2tps ou 4tps"]
["v7.9r24c0","[XLS] Meme xls pour ACCDI et DCCDI, Ajout cellule N28 pour calibrer le délai \"I4\" en fct du temps de calcul du firmware (calibré en DCCDI en 028 RAF: ACCDI)"]
[null,"[XLS] Desormais meme XLS pour AC et DCCDI"]
[null,"[SOFT] Correction: Si pickup arreté a 1 durant 1sec, ne redemarrait plus car MEMTMR1DEB constamment refixé par INT"]
[null,"[SOFT] Correction: il y avait une 2em spark de 0 jusqu'a 10Hz sauf de 7 a 8Hz (IOC n'etait pas a 0 avant boucle IOC)"]
[null,"[SOFT] modif FW DCCDI 100us est trop gros a HIGH rev et 40us trop petit a LOW rev: RETARDL[79] utilise une valeur STEP selectionnable de 20 a 40us et RETARDH[79] utilise une valeur STEP forcée a 100us"]
["v7.9r25c0","[SOFT,XLS] Simplification a low RPM, un seul onglet d'avance plate ajustable car on tient compte des débordements de TMR1H"]
[null,"[XLS] Correction formule du temps pour 1degré dans \"lowrpm\" pour que valeurs soient juste aussi en mode \"4tps no wasted spark\""]
[null,"[XLS] Correction: il fallait soustraire l'hysteresis de  200us plus le temps de calcul dans \"LowRPM\" aussi"]
[null,"[XLS] Correction: a lowrpm et si TMRDEB = 0 alors le temps de calcul dans la bcl de decrement periode est 10µs plus longue. (le rajouter a I2 dans cell W9 ou [fait] le soustraire dans la bcl FC"]
[null,"[SOFT] Correction: a lowrpm soustraire le temps de calcul dans la bcl FC  VLRPM -10"]

{"sheet":"Excel","index":9,"n_rows":10,"n_cols":3,"rows_kept":10,"cut":false,"hidden":false,"merged":[]}
[]
[]
["Conversion de valeurs: ",null,"=SI(I2=2;2;(SI(I2=3;3;(SI(I2=4;4;(SI(I2=5;5;(SI(I2=6;6)))))))))"]
[]
["Liste deroulante: ",null,"Donnees> Validite des donnees"]
[]
[]
["les graphes n'affichent pas la valeur #N/A  , utiliser #N/A pour faire disparaitre les points du graphe"]
[]
["Pour afficher les liens d'une cellule: selectionner la > Formule > Reperer les antécédents/dependants "]