{"text_format":"1","workbook":"xlsx","n_sheets":10,"sheets":["README","Advance_curve","LowRPM","EEPROM16","Accuracy","formules","Calculs","Dwell variable","Version","Excel"],"not_rendered":{"charts":6,"images":3,"macros":0,"external_links":0,"defined_names":2,"comments":4,"pivot_tables":0},"unopened":[],"bounds":{"document_bytes":16777216,"sheet_cells":100000,"rows_first":2000,"rows_last":500,"rows_between":2000,"halvings":0,"cell_chars":16384,"cell_head_chars":4096},"cells_cut":0,"cells_raw":0,"read":"whole","date_system":"1900"}

{"sheet":"README","index":0,"n_rows":19,"n_cols":8,"rows_kept":19,"cut":false,"hidden":false,"merged":[]}
[]
[null,"With the values your entered, the CDI behavior will be the following:"]
[]
[null,null,null,null,null,null,null,"Where to change that?"]
[]
[]
["A) ",{"$f":"CONCATENATE(\"Flat advance from \",LowRPM!L7,\" to \",Advance_curve!C7,\" RPM\")","v":"Flat advance from 76 to 643 RPM"},null,null,null,null,null,"cell I2 in tab \"lowRPM\""]
[]
["B)",{"$f":"CONCATENATE(\"Advance curve is freely adjustable from \",Advance_curve!C7, \" to \",Advance_curve!D9,\" RPM\")","v":"Advance curve is freely adjustable from 643 to 5095 RPM"},null,null,null,null,null,"cell B9 in tab \"Advance_curve\""]
[]
["C)",{"$f":"CONCATENATE(\"The \",Advance_curve!C7,\" RPM when the processor swap from [advance_curve] tab to the flat [advance_low_rpm] tab is adjustable by cell M42 in tab [Advance_curve]\")","v":"The 643 RPM when the processor swap from [advance_curve] tab to the flat [advance_low_rpm] tab is adjustable by cell M42 in tab [Advance_curve]"}]
[]
[null,"Eprom values to burn into the microcontroller",null,null,null,null,null,"cells O18 to 035 in tab \"Advance_curve\""]
[]
[null,{"$f":"CONCATENATE(\"No spark when engine goes above \",Advance_curve!D9,\"RPM - Act as absolute rev-limiter\")","v":"No spark when engine goes above 5095RPM - Act as absolute rev-limiter"},null,null,null,null,null,"cell B9 in tab \"Advance_curve\""]
{"$rows_left_out":5}
{"sheet":"Advance_curve","index":1,"n_rows":335,"n_cols":25,"rows_kept":335,"cut":false,"hidden":false,"merged":[]}
["27/03/2021",null,null,"Version 16F1827 v7.9r25c1",null,null,null,null,null,null,79,25,1]
[null,"Proc:","16F1827"]
[null,"Clock:",16,"MHz",null,"1 i",null,null,null,null,"Step"]
[null,"Fosc/4",{"$f":"C3/4","v":4},"MHz",null,"pickup position",null,"compute (us)",{"$f":"O28","v":26},null,"(us)"]
[null,"TMR1h max",{"$f":"MAX(B173:B335)","v":182},null,null,50,"degrees BTDC",null,null,null,40,{"$f":"IF(MAX(K9:K103)>254,\"Some warning. Increase STEP cell k5 ?\",\"\")","v":""}]
[null,"Frq min",{"$f":"MIN(C174:C335)","v":10.731456043956044},null,null,null,null,"hysteresis",{"$f":"O42*200","v":200}]
[null,"RPM min",{"$f":"MIN(D175:D335)","v":643},null,null,"4 i",null,null,null,null,{"$f":"IF(ISERROR(K9),\"Load DECHEX macro\",\"\")","v":""}]
[null,"TIMER1H count","Frq\n(Hz)","RPM","time for 1° (µs)","Advance (degrees)","Delay\nneeded\n(ms)","Delay\nnedeed\n(µs)","Delay\nto wait\n(µs)","@\nmap","Values for\nthe map"]
["3 g",23,{"$f":"IFERROR(1000000/(B9*256*($N$30/$C$4)),\"\")","v":84.918478260869563},{"$f":"INT(60*C9*$N$25/2*$N$24)","v":5095},{"$f":"((1000*1000*60)/($N$24*D9))/360","v":32.711808963035658},39,{"$f":"(E9*($F$5-F9))/1000","v":0.35982989859339221},{"$f":"E9*($F$5-F9)","v":359.82989859339222},{"$f":"IF($H9>$I$4+$I$6,INT($H9-$I$4-$I$6),\"out of range\")","v":133},0,{"$f":"IFERROR(IF($I9/$K$5>255,255,IF($I9>0.01,INT($I9/$K$5),1)),255)","v":3},{"$f":"IF($I9/$K$5>255,CONCATENATE(\"WARNING: Timing will be more then \",F9,\"°\"),\"\")","v":""},null,null,null,null,null,null,null,null,null,null,null,null,{"$f":"CONCATENATE(K9,\"         ;\",ROUND(D9,0),\"rpm | \",ROUND(F9,1),\"° | \",,ROUND(G9,2),\"ms \")","v":"3         ;5095rpm | 39° | 0,36ms "}]
[{"$f":"IF($B10>255,CONCATENATE(\"ERROR: Timer1H too large\"),\"\")","v":""},{"$f":"IF((B9+1)<(N$44+$B$9),B9+1,\"- End -\")","v":24},{"$f":"IFERROR(1000000/(B10*256*($N$30/$C$4)),\"\")","v":81.380208333333329},{"$f":"INT(60*C10*$N$25/2*$N$24)","v":4882},34.139014065273798,39,0.37552915471801179,375.5291547180118,{"$f":"IF($H10>$I$4+$I$6,INT($H10-$I$4-$I$6),\"out of range\")","v":149},1,3,"",null,null,null,null,null,null,null,null,null,null,null,null,"3         ;4882rpm | 39° | 0,38ms "]
["",25,78.125,{"$f":"INT(60*C11*$N$25/2*$N$24)","v":4687},35.559348552734519,39,0.39115283408007973,391.15283408007974,{"$f":"IF($H11>$I$4+$I$6,INT($H11-$I$4-$I$6),\"out of range\")","v":165},2,4,"",null,null,null,null,null,null,null,null,null,null,null,null,"4         ;4687rpm | 39° | 0,39ms "]
["",26,75.120192307692307,4507,36.979513349604318,39,0.40677464684564751,406.77464684564751,180,3,4,"",null,null,null,null,null,null,null,null,null,null,null,null,"4         ;4507rpm | 39° | 0,41ms "]
["",27,72.337962962962962,4340,38.402457757296467,39,0.42242703533026116,422.42703533026116,196,4,4,"",null,null,null,null,null,null,null,null,null,null,null,null,"4         ;4340rpm | 39° | 0,42ms "]
["",28,69.754464285714292,4185,39.82477100756671,39,0.43807248108323382,438.07248108323381,212,5,5,"",null,null,null,null,null,null,null,null,null,null,null,null,"5         ;4185rpm | 39° | 0,44ms "]
["",29,67.349137931034477,4040,41.254125412541256,39,0.45379537953795379,453.79537953795381,227,6,5,"",null,null,null,null,null,null,null,null,null,null,null,null,"5         ;4040rpm | 39° | 0,45ms "]
{"$rows_left_out":321}
{"sheet":"LowRPM","index":2,"n_rows":36,"n_cols":26,"rows_kept":36,"cut":false,"hidden":false,"merged":[[0,6,0,7]]}
[]
[null,"Advance at low RPM",null,{"$f":"CONCATENATE(\"from \",L7,\" to\")","v":"from 76 to"},{"$f":"CONCATENATE(ROUNDDOWN(Advance_curve!C7,0),\" RPM\")","v":"643 RPM"},null,null,"VLRPM",26,"us"]
[]
[null,null,null,"Cylinder(s) =",{"$f":"Advance_curve!N24","v":1},null,null,"Fosc/4",{"$f":"Advance_curve!C4","v":4},"MHz","TMR1deb max",{"$f":"48/I5","v":6}]
[null,null,null,"Strokes =",{"$f":"Advance_curve!N25","v":2},"STK",null,"Prescaler",{"$f":"Advance_curve!N30","v":8},null,"durée debords max",{"$f":"L4*I7","v":780.30000000000007},"ms"]
[null,null,null,"Pkp position =",{"$f":"Advance_curve!$F$5","v":50},"° BTDC",null,"periode TMR1L",{"$f":"I5/I4","v":2},"ms","Frq mini",{"$f":"1000/L5","v":1.2815583749839805},"Hz","Frq",null,"periode","periode","1°","Timer1","TMR1h","TMR1deb","TMR1rest","Delay","Delay needed","Delay","advance"]
[null,null,null,"RPM limit =",{"$f":"IF(Advance_curve!N30=1,\"336\",IF(Advance_curve!N30=2,\"168\",IF(Advance_curve!N30=4,\"84\",IF(Advance_curve!N30=8,\"42\",\"False\"))))","v":"42"},"RPM",null,"débord TMR1H",{"$f":"255*255*I6/1000","v":130.05000000000001},"ms","RPM mini",{"$f":"INT(60*L6*E5/2*E4)","v":76},"RPM","Hz","RPM","µs","ms","us",null,null,null,null,"µs","µs","degres","degres BTDC"]
[null,null,null,null,null,null,null,null,null,null,null,null,null,1,{"$f":"IF(N8=\"End\",\" \",(N8*60*$E$5)/(2*$E$4))","v":60},{"$f":"1000000/N8","v":1000000},{"$f":"P8/1000","v":1000},{"$f":"((1000*1000*60)/($E$4*O8))/360","v":2777.7777777777778},{"$f":"IF(N8=\"End\",\" \",INT(P8*Advance_curve!$C$4)/$I$5)","v":500000},{"$f":"IF(N8=\"End\",\" \",S8/255)","v":1960.7843137254902},{"$f":"INT(T8/255)","v":7},{"$f":"T8-U8*255","v":175.78431372549016},{"$f":"IF(U8<6,(U8*255*$I$2)+(V8*($I$2+0)),$I$2*(5*255+V8))","v":37720.392156862741},{"$f":"W8","v":37720.392156862741},{"$f":"X8/R8","v":13.579341176470587},{"$f":"$E$6-Y8","v":36.420658823529415}]
[null,null,null,null,null,null,null,"temps calcul",22,"µs",null,null,null,1.5,{"$f":"IF(N9=\"End\",\" \",(N9*60*$E$5)/(2*$E$4))","v":90},{"$f":"1000000/N9","v":666666.66666666663},{"$f":"P9/1000","v":666.66666666666663},{"$f":"((1000*1000*60)/($E$4*O9))/360","v":1851.8518518518517},{"$f":"IF(N9=\"End\",\" \",INT(P9*Advance_curve!$C$4)/$I$5)","v":333333.25},{"$f":"IF(N9=\"End\",\" \",S9/255)","v":1307.1892156862746},{"$f":"INT(T9/255)","v":5},{"$f":"T9-U9*255","v":32.189215686274565},33986.919607843141,{"$f":"W9","v":33986.919607843141},{"$f":"X9/R9","v":18.352936588235298},{"$f":"$E$6-Y9","v":31.647063411764702}]
[null,null,null,null,null,null,null,"hysteresis",{"$f":"Advance_curve!I6","v":200},"µs",null,null,null,{"$f":"IF(N8<Advance_curve!C$6,N8+1,\"End\")","v":2},120,500000,500,{"$f":"((1000*1000*60)/($E$4*O10))/360","v":1388.8888888888889},{"$f":"IF(N10=\"End\",\" \",INT(P10*Advance_curve!$C$4)/$I$5)","v":250000},980.39215686274508,{"$f":"INT(T10/255)","v":3},{"$f":"T10-U10*255","v":215.39215686274508},25490.196078431371,25490.196078431371,{"$f":"X10/R10","v":18.352941176470587},{"$f":"$E$6-Y10","v":31.647058823529413}]
[null,null,null,null,null,null,null,null,null,null,null,null,null,{"$f":"IF(N10<Advance_curve!$C$6,N10+1,\"End\")","v":3},180,333333.33333333331,333.33333333333331,925.92592592592587,{"$f":"IF(N11=\"End\",\" \",INT(P11*Advance_curve!$C$4)/$I$5)","v":166666.625},653.59460784313728,2,143.59460784313728,16993.459803921571,16993.459803921571,{"$f":"X11/R11","v":18.352936588235298},{"$f":"IF($U11<5,$E$6-Y11,\"0\")","v":31.647063411764702}]
[null,null,null,null,null,null,null,null,null,null,null,null,null,{"$f":"IF(N11<Advance_curve!$C$6,N11+1,\"End\")","v":4},240,250000,250,694.44444444444446,{"$f":"IF(N12=\"End\",\" \",INT(P12*Advance_curve!$C$4)/$I$5)","v":125000},490.19607843137254,1,235.19607843137254,12745.098039215685,12745.098039215685,18.352941176470587,31.647058823529413]
[null,null,null,null,null,null,null,null,null,null,null,null,null,{"$f":"IF(N12<Advance_curve!$C$6,N12+1,\"End\")","v":5},300,200000,200,555.55555555555554,{"$f":"IF(N13=\"End\",\" \",INT(P13*Advance_curve!$C$4)/$I$5)","v":100000},392.15686274509807,1,137.15686274509807,10196.078431372549,10196.078431372549,18.352941176470587,31.647058823529413]
[null,null,null,null,null,null,null,null,null,null,null,null,null,{"$f":"IF(N13<Advance_curve!$C$6,N13+1,\"End\")","v":6},360,166666.66666666666,166.66666666666666,462.96296296296293,{"$f":"IF(N14=\"End\",\" \",INT(P14*Advance_curve!$C$4)/$I$5)","v":83333.25},326.79705882352943,1,71.797058823529426,8496.7235294117654,8496.7235294117654,18.352922823529415,31.647077176470585]
[null,null,null,null,null,null,null,null,null,null,null,null,null,{"$f":"IF(N14<Advance_curve!$C$6,N14+1,\"End\")","v":7},420,142857.14285714287,142.85714285714286,396.82539682539687,{"$f":"IF(N15=\"End\",\" \",INT(P15*Advance_curve!$C$4)/$I$5)","v":71428.5},280.11176470588236,1,25.111764705882365,7282.9058823529413,7282.9058823529413,18.352922823529411,31.647077176470589]
{"$rows_left_out":22}
{"sheet":"EEPROM16","index":3,"n_rows":81,"n_cols":24,"rows_kept":81,"cut":false,"hidden":false,"merged":[]}
[null,null,null,null,null,null,null,null,null,null,null,null,null,null,"INTEL 16HEX format",null,"RAW format"]
[null,null,null,null,null,null,null,null,null,null,null,null,null,null,":020000040000FA",null,null,null,null,null,null,null,null,"Hash"]
["Bytes\n in Row","Address MSB (hex)","Address LSB (hex)","Address Start (MSB)","Address\nStart\n(LSB)","+0","+1","+2","+3","+4","+5","+6","+7",null,":020000040001F9",null,null,null,"sum[dec]","sum[hex]","LSB","two's\ncomplement [dec]","two's\ncomplement +1","cksum"]
[16,"E0",{"$f":"DEC2HEX(E4,2)","v":"00"},224,0,{"$f":"ROUND(Advance_curve!$K9,0)","v":3},{"$f":"ROUND(Advance_curve!$K10,0)","v":3},{"$f":"ROUND(Advance_curve!$K11,0)","v":4},{"$f":"ROUND(Advance_curve!$K12,0)","v":4},{"$f":"ROUND(Advance_curve!$K13,0)","v":4},{"$f":"ROUND(Advance_curve!$K14,0)","v":5},{"$f":"ROUND(Advance_curve!$K15,0)","v":5},{"$f":"ROUND(Advance_curve!$K16,0)","v":6},null,{"$f":"\":\"&DEC2HEX(A4,2)&B4&C4&\"00\"&DEC2HEX(F4,2)&\"00\"&DEC2HEX(G4,2)&\"00\"&DEC2HEX(H4,2)&\"00\"&DEC2HEX(I4,2)&\"00\"&DEC2HEX(J4,2)&\"00\"&DEC2HEX(K4,2)&\"00\"&DEC2HEX(L4,2)&\"00\"&DEC2HEX(M4,2)&\"00\"&X4","v":":10E0000003000300040004000400050005000600EE"},null,{"$f":"DEC2HEX(F4,2)&\" \"&DEC2HEX(G4,2)&\" \"&DEC2HEX(H4,2)&\" \"&DEC2HEX(I4,2)&\"   \"&DEC2HEX(J4,2)&\" \"&DEC2HEX(K4,2)&\" \"&DEC2HEX(L4,2)&\" \"&DEC2HEX(M4,2)","v":"03 03 04 04   04 05 05 06"},null,{"$f":"SUM(A4,D4:M4)","v":274},{"$f":"DEC2HEX(S4)","v":"112"},{"$f":"RIGHT(T4,2)","v":"12"},{"$f":"255-HEX2DEC(U4)","v":237},{"$f":"V4+1","v":238},{"$f":"IF(W4=256,\"00\",DEC2HEX(W4,2))","v":"EE"}]
[16,"E0","10",224,16,{"$f":"ROUND(Advance_curve!$K17,0)","v":6},{"$f":"ROUND(Advance_curve!$K18,0)","v":6},{"$f":"ROUND(Advance_curve!$K19,0)","v":7},{"$f":"ROUND(Advance_curve!$K20,0)","v":7},{"$f":"ROUND(Advance_curve!$K21,0)","v":8},{"$f":"ROUND(Advance_curve!$K22,0)","v":8},{"$f":"ROUND(Advance_curve!$K23,0)","v":8},{"$f":"ROUND(Advance_curve!K24,0)","v":9},null,":10E0100006000600070007000800080008000900C5",null,"06 06 07 07   08 08 08 09",null,315,"13B","3B",196,197,"C5"]
[16,"E0","20",224,32,{"$f":"ROUND(Advance_curve!$K25,0)","v":9},{"$f":"ROUND(Advance_curve!$K26,0)","v":12},{"$f":"ROUND(Advance_curve!$K27,0)","v":14},{"$f":"ROUND(Advance_curve!$K28,0)","v":16},{"$f":"ROUND(Advance_curve!$K29,0)","v":17},{"$f":"ROUND(Advance_curve!$K30,0)","v":19},{"$f":"ROUND(Advance_curve!$K31,0)","v":21},{"$f":"ROUND(Advance_curve!$K32,0)","v":23},null,":10E0200009000C000E00100011001300150017006D",null,"09 0C 0E 10   11 13 15 17",null,403,"193","93",108,109,"6D"]
[16,"E0","30",224,48,{"$f":"ROUND(Advance_curve!$K33,0)","v":24},{"$f":"ROUND(Advance_curve!$K34,0)","v":26},{"$f":"ROUND(Advance_curve!$K35,0)","v":28},{"$f":"ROUND(Advance_curve!$K36,0)","v":30},{"$f":"ROUND(Advance_curve!$K37,0)","v":31},{"$f":"ROUND(Advance_curve!$K38,0)","v":33},{"$f":"ROUND(Advance_curve!$K39,0)","v":35},{"$f":"ROUND(Advance_curve!$K40,0)","v":37},null,":10E0300018001A001C001E001F00210023002500EC",null,"18 1A 1C 1E   1F 21 23 25",null,532,"214","14",235,236,"EC"]
[16,"E0","40",224,64,{"$f":"ROUND(Advance_curve!$K41,0)","v":39},{"$f":"ROUND(Advance_curve!$K42,0)","v":40},{"$f":"ROUND(Advance_curve!$K43,0)","v":42},{"$f":"ROUND(Advance_curve!$K44,0)","v":44},{"$f":"ROUND(Advance_curve!$K45,0)","v":46},{"$f":"ROUND(Advance_curve!$K46,0)","v":47},{"$f":"ROUND(Advance_curve!$K47,0)","v":49},{"$f":"ROUND(Advance_curve!$K48,0)","v":51},null,":10E04000270028002A002C002E002F00310033006A",null,"27 28 2A 2C   2E 2F 31 33",null,662,"296","96",105,106,"6A"]
[16,"E0","50",224,80,{"$f":"ROUND(Advance_curve!$K49,0)","v":53},{"$f":"ROUND(Advance_curve!$K50,0)","v":54},{"$f":"ROUND(Advance_curve!$K51,0)","v":56},{"$f":"ROUND(Advance_curve!$K52,0)","v":58},{"$f":"ROUND(Advance_curve!$K53,0)","v":60},{"$f":"ROUND(Advance_curve!$K54,0)","v":61},{"$f":"ROUND(Advance_curve!$K55,0)","v":63},{"$f":"ROUND(Advance_curve!$K56,0)","v":65},null,":10E050003500360038003A003C003D003F004100EA",null,"35 36 38 3A   3C 3D 3F 41",null,790,"316","16",233,234,"EA"]
[16,"E0","60",224,96,{"$f":"ROUND(Advance_curve!$K57,0)","v":67},{"$f":"ROUND(Advance_curve!$K58,0)","v":69},{"$f":"ROUND(Advance_curve!$K59,0)","v":70},{"$f":"ROUND(Advance_curve!$K60,0)","v":72},{"$f":"ROUND(Advance_curve!$K61,0)","v":74},{"$f":"ROUND(Advance_curve!$K62,0)","v":76},{"$f":"ROUND(Advance_curve!$K63,0)","v":77},{"$f":"ROUND(Advance_curve!$K64,0)","v":79},null,":10E0600043004500460048004A004C004D004F0068",null,"43 45 46 48   4A 4C 4D 4F",null,920,"398","98",103,104,"68"]
[16,"E0","70",224,112,{"$f":"ROUND(Advance_curve!$K65,0)","v":81},{"$f":"ROUND(Advance_curve!$K66,0)","v":83},{"$f":"ROUND(Advance_curve!$K67,0)","v":84},{"$f":"ROUND(Advance_curve!$K68,0)","v":86},{"$f":"ROUND(Advance_curve!$K69,0)","v":88},{"$f":"ROUND(Advance_curve!$K70,0)","v":90},{"$f":"ROUND(Advance_curve!$K71,0)","v":92},{"$f":"ROUND(Advance_curve!$K72,0)","v":93},null,":10E07000510053005400560058005A005C005D00E7",null,"51 53 54 56   58 5A 5C 5D",null,1049,"419","19",230,231,"E7"]
[16,"E0","80",224,128,{"$f":"ROUND(Advance_curve!$K73,0)","v":95},{"$f":"ROUND(Advance_curve!$K74,0)","v":97},{"$f":"ROUND(Advance_curve!$K75,0)","v":99},{"$f":"ROUND(Advance_curve!$K76,0)","v":100},{"$f":"ROUND(Advance_curve!$K77,0)","v":102},{"$f":"ROUND(Advance_curve!$K78,0)","v":104},{"$f":"ROUND(Advance_curve!$K79,0)","v":106},{"$f":"ROUND(Advance_curve!$K80,0)","v":108},null,":10E080005F00610063006400660068006A006C0065",null,"5F 61 63 64   66 68 6A 6C",null,1179,"49B","9B",100,101,"65"]
[16,"E0","90",224,144,{"$f":"ROUND(Advance_curve!$K81,0)","v":109},{"$f":"ROUND(Advance_curve!$K82,0)","v":111},{"$f":"ROUND(Advance_curve!$K83,0)","v":114},{"$f":"ROUND(Advance_curve!$K84,0)","v":118},{"$f":"ROUND(Advance_curve!$K85,0)","v":121},{"$f":"ROUND(Advance_curve!$K86,0)","v":124},{"$f":"ROUND(Advance_curve!$K87,0)","v":127},{"$f":"ROUND(Advance_curve!$K88,0)","v":129},null,":10E090006D006F007200760079007C007F008100C7",null,"6D 6F 72 76   79 7C 7F 81",null,1337,"539","39",198,199,"C7"]
[16,"E0","A0",224,160,{"$f":"ROUND(Advance_curve!$K89,0)","v":52},{"$f":"ROUND(Advance_curve!$K90,0)","v":53},{"$f":"ROUND(Advance_curve!$K91,0)","v":54},{"$f":"ROUND(Advance_curve!$K92,0)","v":55},{"$f":"ROUND(Advance_curve!$K93,0)","v":56},{"$f":"ROUND(Advance_curve!$K94,0)","v":57},{"$f":"ROUND(Advance_curve!$K95,0)","v":58},{"$f":"ROUND(Advance_curve!$K96,0)","v":59},null,":10E0A0003400350036003700380039003A003B00B4",null,"34 35 36 37   38 39 3A 3B",null,844,"34C","4C",179,180,"B4"]
[16,"E0","B0",224,176,{"$f":"ROUND(Advance_curve!K97,0)","v":60},{"$f":"ROUND(Advance_curve!K98,0)","v":61},{"$f":"ROUND(Advance_curve!K99,0)","v":62},{"$f":"ROUND(Advance_curve!K100,0)","v":63},{"$f":"ROUND(Advance_curve!K101,0)","v":63},{"$f":"ROUND(Advance_curve!K102,0)","v":64},{"$f":"ROUND(Advance_curve!K103,0)","v":66},{"$f":"ROUND(Advance_curve!K104,0)","v":73},null,":10E0B0003C003D003E003F003F0040004200490060",null,"3C 3D 3E 3F   3F 40 42 49",null,928,"3A0","A0",95,96,"60"]
{"$rows_left_out":67}
{"sheet":"Accuracy","index":4,"n_rows":16,"n_cols":3,"rows_kept":16,"cut":false,"hidden":false,"merged":[]}
["CYLINDRE:",1,"cyl"]
["STROKES",2,"stk"]
["ACCURACY",3.4,"us"]
[]
["RPM","ERROR"]
[0,0]
[1000,{"$f":"$B$3/((1000*(60*$B$2)/(2*$B$1*$A7))/0.36)","v":2.0399999999999998E-2}]
[2000,4.0799999999999996E-2]
[3000,6.1199999999999997E-2]
[4000,8.1599999999999992E-2]
[5000,0.10199999999999999]
[6000,0.12239999999999999]
[7000,0.14279999999999998]
[8000,0.16319999999999998]
[9000,0.18359999999999999]
{"$rows_left_out":2}
{"sheet":"formules","index":5,"n_rows":66,"n_cols":25,"rows_kept":66,"cut":false,"hidden":false,"merged":[[63,4,63,7],[63,8,63,11],[64,4,64,7],[64,8,64,11],[65,4,65,11],[0,10,0,11],[16,10,16,11],[16,13,16,14],[16,15,16,16],[17,15,17,16]]}
[null,null,null,null,"TEMPS","CYLINDRE","RPM","FREQUENCE","PERIODE","PERIODE","1°",null,"durée =","degrés","relatif\npickup"]
[null,null,null,null,"Nbr","Nbr","tr/mn","Hz","ms","pour 2cyl 2tps","ms","us","us",null,{"$f":"Advance_curve!F5","v":50},null,null,null,null,null,null,null,"4 stk:"]
[null,null,null,null,2,1,9000,{"$f":"(2*$F$3*$G$3)/(60*$E$3)","v":150},{"$f":"1000*(60*$E$3)/(2*$F$3*$G$3)","v":6.666666666666667},{"$f":"1000*60/$G$3","v":6.666666666666667},{"$f":"I3/360","v":1.8518518518518521E-2},{"$f":"I3/0.36","v":18.518518518518519},64000,{"$f":"M3/L3","v":3456},{"$f":"Advance_curve!F5-N3","v":-3406},null,null,null,null,null,null,null,"1 cyl","1/2 spark every rotation","720°"]
[null,null,null,null,null,null,null,null,{"$f":"1000*I3","v":6666.666666666667},null,null,null,null,null,null,null,null,null,null,null,null,null,"2 cyl","1 spark every rotation","360°"]
[null,null,null,null,null,null,{"$f":"(60*$H$5*$E$3)/(2*$F$3)","v":120},2,{"$f":"1000*(60*$E$3)/(2*$F$3*$G$5)","v":500},{"$f":"1000*60/$G$5","v":500},{"$f":"I5/360","v":1.3888888888888888},{"$f":"I5/0.36","v":1388.8888888888889},null,"FRQ = (2*CYL*RPM) / (60*TEMPS)",null,null,null,null,null,null,null,null,"3 cyl","1,5 spark every rotation","240°"]
[null,null,null,null,null,null,null,null,null,null,null,null,null,"RPM = (60*FRQ*TEMPS) / ( 2*CYL)",null,null,null,null,null,null,null,null,"4 cyl","2 sparks every rotation","180°"]
[null,null,null,null,null,null,"Délai","=>","Délai","Avance",null,null,null,"1degré = (1000*1000*60*CYL) / ( 2*TEMPS*RPM)/360",null,null,null,null,null,null,null,null,"5 cyl","2,5 sparks every rotation","144°"]
[null,null,null,null,null,null,"us",null,"°","°",null,null,null,"RPM= 60*1000000/ TMR1*256*presc/Fosc",null,null,null,null,null,null,null,null,"6 cyl","3 sparks every rotation","120°"]
[null,null,null,null,null,null,9600,null,{"$f":"G9/L3","v":518.4},{"$f":"Advance_curve!F5 -I9","v":-468.4},null,null,null,"TMR1=(PER*Fosc)/ presc*255",null,null,null,null,null,null,null,null,"10 cyl","5 sparks every rotation","72°"]
[null,null,null,null,null,null,null,null,null,null,null,null,null,"FRQ = 1/TMR1H = 1/TMR1H * (255 * PRES/Fosc) = 1*1000000 / TMR1H* (255 * PRES/Fosc) ",null,null,null,null,null,null,null,null,"12 cyl","6 sparks every rotation","60°"]
[2.5,null,null,null,null,null,"Frequence","=>","RPM","PERIODE"]
[null,null,null,null,null,null,11,"Hz",{"$f":"60*G12*$E$3/2*$F$3","v":660},{"$f":"1000/G12","v":90.909090909090907},"ms"]
[]
[null,null,null,null,null,null,"Periode","=>","RPM","FRQ",null,null,null,null,null,null,null,null,"2 stk = 1 sprk per rev."]
[null,null,null,null,null,null,11,"ms",{"$f":"60*(1000/G15)*$E$3/2*$F$3","v":5454.545454545454},{"$f":"1000/G15","v":90.909090909090907},"Hz",null,null,null,null,null,null,null,"4 stk = 1 sprk per 2 rev."]
{"$rows_left_out":52}
{"sheet":"Calculs","index":6,"n_rows":39,"n_cols":6,"rows_kept":39,"cut":false,"hidden":false,"merged":[]}
[]
["- Tant que pickup est bas (=0) 99% du temps, on met la valeur du TIMER0 dans la variable PERL (PERiode Low)"]
["- Chaque fois que TIMER0 provoque une INTerruption de debordement lorsqu'il arrive a 255,  dans la routine d'interruption on incremente TMR0H (TIMER0 High)"]
["- Quand le pickup est haut (=1) (pulse) :"]
["- on memorise la valeur de TMR0H (Nbr de debordements de TIMER0), dans PERH (PERiode High)"]
["- et on memorise aussi la valeur du TIMER0 dans la variable PERL."]
["- puis on RAZ les timers,"]
[]
["- Ainsi la durée ecoulé entre 2 pickups est stockée dans PERL et PERH.   Soit : (PERH x 255 ) + PERL"]
[]
["Avec Q=4MHz, Prescaler = 256 et Preset = 0"]
["TIMER0 s'incremente toutes les 256us et deborde toutes les 256x256= 65536us = 65,5ms = 15,25Hz"]
["(utiliser: E:\\Pic\\Exemples\\pic_calculations.xls)"]
["- donc [ (PERH * 255 ) + PERL ] * 65,5ms = durée entre 2 pulses."]
[]
{"$rows_left_out":25}
{"sheet":"Dwell variable","index":7,"n_rows":98,"n_cols":5,"rows_kept":98,"cut":false,"hidden":false,"merged":[]}
[]
[null,null,null,"coef:","DWELL = PERIODE * 50"]
[null,{"$f":"Advance_curve!B8","v":"TIMER1H count"},null,50]
[null,{"$f":"Advance_curve!B9","v":23},{"$f":"$D$3*Advance_curve!B9","v":1150},"µs"]
[null,{"$f":"Advance_curve!B10","v":24},{"$f":"$D$3*Advance_curve!B10","v":1200}]
[null,{"$f":"Advance_curve!B11","v":25},{"$f":"$D$3*Advance_curve!B11","v":1250}]
[null,{"$f":"Advance_curve!B12","v":26},{"$f":"$D$3*Advance_curve!B12","v":1300}]
[null,{"$f":"Advance_curve!B13","v":27},{"$f":"$D$3*Advance_curve!B13","v":1350}]
[null,{"$f":"Advance_curve!B14","v":28},{"$f":"$D$3*Advance_curve!B14","v":1400}]
[null,{"$f":"Advance_curve!B15","v":29},{"$f":"$D$3*Advance_curve!B15","v":1450}]
[null,{"$f":"Advance_curve!B16","v":30},{"$f":"$D$3*Advance_curve!B16","v":1500}]
[null,{"$f":"Advance_curve!B17","v":31},{"$f":"$D$3*Advance_curve!B17","v":1550}]
[null,{"$f":"Advance_curve!B18","v":32},{"$f":"$D$3*Advance_curve!B18","v":1600}]
[null,{"$f":"Advance_curve!B19","v":33},{"$f":"$D$3*Advance_curve!B19","v":1650}]
[null,{"$f":"Advance_curve!B20","v":34},{"$f":"$D$3*Advance_curve!B20","v":1700}]
{"$rows_left_out":84}
{"sheet":"Version","index":8,"n_rows":73,"n_cols":2,"rows_kept":73,"cut":false,"hidden":false,"merged":[]}
[]
["v7.9r13c2","[HARD] Correction RA1 forcé a 1, car pullup R5 sur PCB"]
["v7.9r13c3","[XLS] Valeur de dwell passe de 2 choix (500,1000) a 6 choix (500,1000,2000,3000,4000,5000)."]
["v7.9r14c0","[SOFT,XLS] Ajout d'une valeur de dwell \"AUTO\" pour lequel la durée de dwell est proportionnelle a PERIODE."]
["v7.9r14c1","[SOFT] Code protection OFF"]
["v7.9r15c0","[XLS] La valeur d'avance affichée dans l'onglet \"advance_at_lowRPM\" ne prenait pas en compte la position du pickup, c'était donc une valeur RELATIVE, pas ABSOLUE. Multiplicateur peut descendre a 1 (soft OK)"]
[null,"[SOFT] si JP2 a la masse alors PIC bypass la courbe d'avance et envoi spark dés que detection front descendant du pickup"]
[null,"[SOFT] RB3 (ex TP2) n'était pas forcé en OUTPUT"]
[null,"[HARD] Suppression TP2 inutile"]
[null,"[HARD] Reduction R7 de 330 a 180 (Sinon ne declenche pas les SCR de type BTA)."]
[null,"[HARD] Suppression C9-100n car courant d'appel dépasse Imax du PIC"]
["v7.9r16c0","[XLS] La valeur d'avance affichée dans l'onglet \"advance_at_lowRPM\" était fausse."]
[null,"[SOFT] boucles d'attente pkp haut et bas en ASM: Precision x10 !!"]
[null,"[XLS] Ajout documentation onglet README"]
["v7.9r16c1","[XLS] Tuning: a low RPM, le PIC attend 4us x PERIODE mais en vrai bcl dure plus de 4us, du coup il y a un offset de 5deg (20° affiché et 15° reels)\npour simplifier correction: la valeur delay (I1) passe de 4 a 4.4"]
{"$rows_left_out":59}
{"sheet":"Excel","index":9,"n_rows":10,"n_cols":3,"rows_kept":10,"cut":false,"hidden":false,"merged":[]}
[]
[]
["Conversion de valeurs: ",null,"=SI(I2=2;2;(SI(I2=3;3;(SI(I2=4;4;(SI(I2=5;5;(SI(I2=6;6)))))))))"]
[]
["Liste deroulante: ",null,"Donnees> Validite des donnees"]
[]
[]
["les graphes n'affichent pas la valeur #N/A  , utiliser #N/A pour faire disparaitre les points du graphe"]
[]
["Pour afficher les liens d'une cellule: selectionner la > Formule > Reperer les antécédents/dependants "]