{"text_format":"1","workbook":"xlsx","n_sheets":14,"sheets":["README","Advance_curve","advance_at_lowRPM","VeryLowRPM","EEPROM16","Accuracy","formules","TIMERS","Calculs","Dwell variable","Version","Excel","calibrage","Error"],"not_rendered":{"charts":4,"images":3,"macros":0,"external_links":0,"defined_names":2,"comments":6,"pivot_tables":0},"unopened":[],"bounds":{"document_bytes":16777216,"sheet_cells":100000,"rows_first":2000,"rows_last":500,"rows_between":2000,"halvings":0,"cell_chars":16384,"cell_head_chars":4096},"cells_cut":0,"cells_raw":0,"read":"whole","date_system":"1900"}

{"sheet":"README","index":0,"n_rows":17,"n_cols":8,"rows_kept":17,"cut":false,"hidden":false,"merged":[]}
[]
[null,"With the values you have type in, the CDI behavior will be as the following:"]
[]
[null,null,null,null,null,null,null,"Where to change that?"]
[]
["A) ",{"$f":"CONCATENATE(\"0 degrees \",VeryLowRPM!B2)","v":"0 degrees advance from 91 to 480 RPM"},null,null,null,null,null,"default behavior, Can be altered by changing cell C11 in VeryLowRPM tab"]
[]
["B)",{"$f":"CONCATENATE(\"Flat advance from \",advance_at_lowRPM!Z7,\" to \",Advance_curve!D103,\"RPM\")","v":"Flat advance from 480 to 1001RPM"},null,null,null,null,null,"cell I2 in tab \"advance_at_lowRPM\""]
[]
["C)",{"$f":"CONCATENATE(\"Advance curve is freely adjustable from \",Advance_curve!D103, \" to \",Advance_curve!D11,\"RPM\")","v":"Advance curve is freely adjustable from 1001 to 4687RPM"},null,null,null,null,null,"column F in tab \"Advance_curve\""]
[]
["D)",{"$f":"CONCATENATE(\"No spark when engine goes above \",Advance_curve!D9,\"RPM - Act as absolute rev-limiter\")","v":"No spark when engine goes above 5095RPM - Act as absolute rev-limiter"},null,null,null,null,null,"cell B9 in tab \"Advance_curve\""]
[]
[null,"Eprom values to burn into the microcontroller are in",null,null,null,null,null,"cells Q17 to Q51 in tab \"Advance_curve\""]
[]
[]
[null,"ONLY YELLOW CELLS ARE CHANGEABLE"]

{"sheet":"Advance_curve","index":1,"n_rows":335,"n_cols":26,"rows_kept":335,"cut":false,"hidden":false,"merged":[[7,9,7,10]]}
["05/02/2021",null,null,"Version DC-CDI v79r7c11",null,null,null,null,1,79,7,11]
[null,"Proc:","16F1827"]
[null,"Clock:",16,"MHz",null,"1 i",null,null,"incompressible",null,null,"Step"]
[null,"Fosc/4",{"$f":"C3/4","v":4},"MHz",null,"pickup position",null,null,"delay (us)",null,null,"(us)"]
[null,"TMR1h max",{"$f":"MAX(B173:B335)","v":117},null,null,50,"degrees BTDC",null,390,null,null,40]
[null,"Frq min",{"$f":"MIN(D174:D335)","v":16.693376068376068},null,null,{"$f":"IF(MAX(L9:L103)>254,\"Some cells warn. Increase STEP cell L5 ?\",\"\")","v":""}]
[null,"RPM min",{"$f":"MIN(D175:D335)","v":16.693376068376068},null,null,"4 i",null,null,null,null,null,{"$f":"IF(ISERROR(L9),\"Load DECHEX macro\",\"\")","v":""}]
[null,"TIMER1H count","Frq\n(Hz)","RPM","time for 1° (µs)","Advance (degrees)","Delay needed (ms)","Delay nedeed (µs)","Delay to wait (µs)","Correct\n(us)",null,"Values for\nthe map"]
["3 g",23,{"$f":"IFERROR(1000000/(B9*256*($O$30/$C$4)),\"\")","v":84.918478260869563},{"$f":"INT(60*C9*$O$25/2*$O$24)","v":5095},{"$f":"((1000*1000*60)/($O$24*$D9))/360","v":32.711808963035658},45.779600000000002,{"$f":"(E9*($F$5-F9))/1000","v":0.13805691854759561},{"$f":"E9*($F$5-F9)","v":138.05691854759561},{"$f":"IF($H9>$I$5,INT($H9-$I$5),\"0\")","v":"0"},0,{"$f":"IF(($I9/$L$5)-$J9>255,255,IF($I9>0.01,INT($I9-$J9)/$L$5,1))","v":0},{"$f":"IF($K9 > 0,$K9,0)","v":0},{"$f":"IF($I9/$L$5>255,CONCATENATE(\"WARNING: Timing will be more then \",F9,\"°\"),\"\")","v":""},null,null,null,null,null,null,null,null,null,null,null,null,{"$f":"CONCATENATE(L9,\"         ;\",ROUND(#REF!,0),\"rpm | \",ROUND(F9,1),\"° | \",,ROUND(G9,2),\"ms \")","v":{"$error":"#REF!"}}]
[{"$f":"IF($B10>255,CONCATENATE(\"ERROR: Timer1H too large\"),\"\")","v":""},{"$f":"IF((B9+1)<(95+$B$9),B9+1,\"- End -\")","v":24},{"$f":"IFERROR(1000000/(B10*256*($O$30/$C$4)),\"\")","v":81.380208333333329},{"$f":"INT(60*C10*$O$25/2*$O$24)","v":4882},34.139014065273798,42.889159999999997,0.24275706677591166,242.75706677591165,"0",0,{"$f":"IF(($I10/$L$5)-$J10>255,255,IF($I10>0.01,INT($I10-$J10)/$L$5,1))","v":0},{"$f":"IF($K10 > 0,$K10,0)","v":0},{"$f":"IF($I10/$L$5>255,CONCATENATE(\"WARNING: Timing will be more then \",F10,\"°\"),\"\")","v":""},null,null,null,null,null,null,null,null,null,null,null,null,{"$f":"CONCATENATE(L10,\"         ;\",ROUND(#REF!,0),\"rpm | \",ROUND(F10,1),\"° | \",,ROUND(G10,2),\"ms \")","v":{"$error":"#REF!"}}]
[{"$f":"IF($B11>255,CONCATENATE(\"ERROR: Timer1H too large\"),\"\")","v":""},{"$f":"IF((B10+1)<(95+$B$9),B10+1,\"- End -\")","v":25},78.125,4687,35.559348552734519,40.361319999999999,0.34274518170827117,342.74518170827116,"0",0,0,0,"",null,null,null,null,null,null,null,null,null,null,null,null,{"$f":"CONCATENATE(L11,\"         ;\",ROUND(#REF!,0),\"rpm | \",ROUND(F11,1),\"° | \",,ROUND(G11,2),\"ms \")","v":{"$error":"#REF!"}}]
["",26,75.120192307692307,4507,36.979513349604318,38.128740000000001,0.43899341764662375,438.99341764662375,48,0,1.2,1.2,"",null,null,null,null,null,null,null,null,null,null,null,null,{"$f":"CONCATENATE(L12,\"         ;\",ROUND(#REF!,0),\"rpm | \",ROUND(F12,1),\"° | \",,ROUND(G12,2),\"ms \")","v":{"$error":"#REF!"}}]
["",27,72.337962962962962,4340,38.402457757296467,36.144799999999996,0.53207373271889413,532.07373271889412,142,0,3.55,3.55,"",null,null,null,null,null,null,null,null,null,null,null,null,{"$f":"CONCATENATE(L13,\"         ;\",ROUND(#REF!,0),\"rpm | \",ROUND(F13,1),\"° | \",,ROUND(G13,2),\"ms \")","v":{"$error":"#REF!"}}]
["",28,69.754464285714292,4185,39.82477100756671,34.36806,0.62253843090402239,622.53843090402233,232,0,5.8,5.8,"",null,null,null,null,null,null,null,null,null,null,null,null,{"$f":"CONCATENATE(L14,\"         ;\",ROUND(#REF!,0),\"rpm | \",ROUND(F14,1),\"° | \",,ROUND(G14,2),\"ms \")","v":{"$error":"#REF!"}}]
["",29,67.349137931034477,4040,41.254125412541256,32.772619999999996,0.71070049504950505,710.70049504950509,320,0,8,8,"",null,null,null,null,null,null,null,null,null,null,null,null,{"$f":"CONCATENATE(L15,\"         ;\",ROUND(#REF!,0),\"rpm | \",ROUND(F15,1),\"° | \",,ROUND(G15,2),\"ms \")","v":{"$error":"#REF!"}}]
["",30,65.104166666666671,3906,42.669397508107181,31.327399999999997,0.79674859190988234,796.74859190988229,406,0,10.15,10.15,"",null,null,null,null,null,null,null,null,null,null,null,null,{"$f":"CONCATENATE(L16,\"         ;\",ROUND(#REF!,0),\"rpm | \",ROUND(F16,1),\"° | \",,ROUND(G16,2),\"ms \")","v":{"$error":"#REF!"}}]
["",31,63.00403225806452,3780,44.091710758377424,30.011679999999998,0.8813192239858908,881.31922398589074,491,0,12.275,12.275,"",null,null,"EEprom data ð",{"$f":"CONCATENATE(EEPROM16!O1,\" for PIC 16F1827\")","v":"INTEL 16HEX format for PIC 16F1827"},null,{"$f":"EEPROM16!Q1","v":"RAW format"},null,"MCH format",null,null,null,null,{"$f":"CONCATENATE(L17,\"         ;\",ROUND(#REF!,0),\"rpm | \",ROUND(F17,1),\"° | \",,ROUND(G17,2),\"ms \")","v":{"$error":"#REF!"}}]
["",32,61.03515625,3662,45.512470416894232,28.815100000000001,0.96417713453486265,964.1771345348626,574,0,14.35,14.35,"",null,null,null,null,null,null,null,null,null,null,null,null,{"$f":"CONCATENATE(L18,\"         ;\",ROUND(#REF!,0),\"rpm | \",ROUND(F18,1),\"° | \",,ROUND(G18,2),\"ms \")","v":{"$error":"#REF!"}}]
["",33,59.185606060606062,3551,46.935135642542008,27.711759999999998,1.0461015676335306,1046.1015676335305,656,0,16.399999999999999,16.399999999999999,"",null,null,null,{"$f":"EEPROM16!O2","v":":020000040000FA"},null,null,null,{"$f":"DEC2HEX(EEPROM16!F$4,2)","v":"00"},null,null,null,null,{"$f":"CONCATENATE(L19,\"         ;\",ROUND(#REF!,0),\"rpm | \",ROUND(F19,1),\"° | \",,ROUND(G19,2),\"ms \")","v":{"$error":"#REF!"}}]
["",34,57.444852941176471,3446,48.365254401238154,26.701659999999997,1.1268301412265429,1126.830141226543,736,0,18.399999999999999,18.399999999999999,"",null,null,null,{"$f":"EEPROM16!O3","v":":020000040001F9"},null,null,null,{"$f":"DEC2HEX(EEPROM16!G$4,2)","v":"00"},null,null,null,null,{"$f":"CONCATENATE(L20,\"         ;\",ROUND(#REF!,0),\"rpm | \",ROUND(F20,1),\"° | \",,ROUND(G20,2),\"ms \")","v":{"$error":"#REF!"}}]
["",35,55.803571428571431,3348,49.780963759458388,25.769259999999996,1.2062295898048589,1206.229589804859,816,0,20.399999999999999,20.399999999999999,"",null,null,null,{"$f":"EEPROM16!O4","v":":10E0000000000000000001000300050008000A00F4"},null,{"$f":"EEPROM16!Q4","v":"00 00 00 01   03 05 08 0A"},null,{"$f":"DEC2HEX(EEPROM16!H$4,2)","v":"00"},null,null,null,null,{"$f":"CONCATENATE(L21,\"         ;\",ROUND(#REF!,0),\"rpm | \",ROUND(F21,1),\"° | \",,ROUND(G21,2),\"ms \")","v":{"$error":"#REF!"}}]
["",36,54.253472222222221,3255,51.203277009728623,24.904199999999996,1.284987199180748,1284.9871991807479,894,0,22.35,22.35,"",null,"2 i",null,{"$f":"EEPROM16!O5","v":":10E010000C000E00100012001400160018001A0066"},null,{"$f":"EEPROM16!Q5","v":"0C 0E 10 12   14 16 18 1A"},null,{"$f":"DEC2HEX(EEPROM16!I$4,2)","v":"01"},null,null,null,null,{"$f":"CONCATENATE(L22,\"         ;\",ROUND(#REF!,0),\"rpm | \",ROUND(F22,1),\"° | \",,ROUND(G22,2),\"ms \")","v":{"$error":"#REF!"}}]
["",37,52.787162162162161,3167,52.626039364277446,24.101300000000002,1.3629460056836122,1362.9460056836122,972,0,24.3,24.3,"",null,null,null,{"$f":"EEPROM16!O6","v":":10E020001C001E001F0021002300250027002900DB"},null,{"$f":"EEPROM16!Q6","v":"1C 1E 1F 21   23 25 27 29"},null,{"$f":"DEC2HEX(EEPROM16!J$4,2)","v":"03"},null,null,null,null,{"$f":"CONCATENATE(L23,\"         ;\",ROUND(#REF!,0),\"rpm | \",ROUND(F23,1),\"° | \",,ROUND(G23,2),\"ms \")","v":{"$error":"#REF!"}}]
["",38,51.398026315789473,3083,54.059898367391071,23.350200000000001,1.4406854795112987,1440.6854795112986,1050,0,26.25,26.25,"","Number of cylinder",1,null,{"$f":"EEPROM16!O7","v":":10E030002B002C002E003000320034003500370055"},null,{"$f":"EEPROM16!Q7","v":"2B 2C 2E 30   32 34 35 37"},null,{"$f":"DEC2HEX(EEPROM16!K$4,2)","v":"05"},null,null,null,null,{"$f":"CONCATENATE(L24,\"         ;\",ROUND(#REF!,0),\"rpm | \",ROUND(F24,1),\"° | \",,ROUND(G24,2),\"ms \")","v":{"$error":"#REF!"}}]
["",39,50.080128205128204,3004,55.481580115401691,22.656079999999996,1.5170838881491346,1517.0838881491347,1127,0,28.175000000000001,28.175000000000001,"",null,{"$f":"IF(O26=\"4 no wasted spark\",4,2)","v":2},null,{"$f":"EEPROM16!O8","v":":10E0400039003B003D003E004000420044004500D3"},null,{"$f":"EEPROM16!Q8","v":"39 3B 3D 3E   40 42 44 45"},null,{"$f":"DEC2HEX(EEPROM16!L$4,2)","v":"08"},null,null,null,null,{"$f":"CONCATENATE(L25,\"         ;\",ROUND(#REF!,0),\"rpm | \",ROUND(F25,1),\"° | \",,ROUND(G25,2),\"ms \")","v":{"$error":"#REF!"}}]
["",40,48.828125,2929,56.902241948332758,22.003399999999999,1.5930693069306929,1593.0693069306928,1203,0,30.074999999999999,30.074999999999999,"","Strokes","4 wasted spark",null,{"$f":"EEPROM16!O9","v":":10E05000470049004B004C004E0050005200530052"},null,{"$f":"EEPROM16!Q9","v":"47 49 4B 4C   4E 50 52 53"},null,{"$f":"DEC2HEX(EEPROM16!M$4,2)","v":"0A"},null,null,null,null,{"$f":"CONCATENATE(L26,\"         ;\",ROUND(#REF!,0),\"rpm | \",ROUND(F26,1),\"° | \",,ROUND(G26,2),\"ms \")","v":{"$error":"#REF!"}}]
["",41,47.637195121951223,2858,58.315838581758804,21.392159999999997,1.6682901796127831,1668.290179612783,1278,0,31.95,31.95,"",null,null,null,{"$f":"EEPROM16!O10","v":":10E060005500570059005A005C005E0060006100D2"},null,{"$f":"EEPROM16!Q10","v":"55 57 59 5A   5C 5E 60 61"},null,{"$f":"DEC2HEX(EEPROM16!F$5,2)","v":"0C"},null,null,null,null,{"$f":"CONCATENATE(L27,\"         ;\",ROUND(#REF!,0),\"rpm | \",ROUND(F27,1),\"° | \",,ROUND(G27,2),\"ms \")","v":{"$error":"#REF!"}}]
["",42,46.50297619047619,2790,59.737156511350058,20.81718,1.7432986857825568,1743.2986857825567,1353,0,33.825000000000003,33.825000000000003,"",null,null,null,{"$f":"EEPROM16!O11","v":":10E0700063006500670068006A006C006D006F0054"},null,{"$f":"EEPROM16!Q11","v":"63 65 67 68   6A 6C 6D 6F"},null,{"$f":"DEC2HEX(EEPROM16!G$5,2)","v":"0E"},null,null,null,null,{"$f":"CONCATENATE(L28,\"         ;\",ROUND(#REF!,0),\"rpm | \",ROUND(F28,1),\"° | \",,ROUND(G28,2),\"ms \")","v":{"$error":"#REF!"}}]
["",43,45.421511627906973,2725,61.162079510703357,20.27328,1.8181480122324158,1818.1480122324158,1428,0,35.700000000000003,35.700000000000003,"",null,null,null,{"$f":"EEPROM16!O12","v":":10E08000710073007400760078007A007B007D00D5"},null,{"$f":"EEPROM16!Q12","v":"71 73 74 76   78 7A 7B 7D"},null,{"$f":"DEC2HEX(EEPROM16!H$5,2)","v":"10"},null,null,null,null,{"$f":"CONCATENATE(L29,\"         ;\",ROUND(#REF!,0),\"rpm | \",ROUND(F29,1),\"° | \",,ROUND(G29,2),\"ms \")","v":{"$error":"#REF!"}}]
["",44,44.389204545454547,2663,62.5860558267618,19.765639999999998,1.892249342846414,1892.249342846414,1502,0,37.549999999999997,37.549999999999997,"","prescaler",8,null,{"$f":"EEPROM16!O13","v":":10E090007F008000820084008600870089008B0057"},null,{"$f":"EEPROM16!Q13","v":"7F 80 82 84   86 87 89 8B"},null,{"$f":"DEC2HEX(EEPROM16!I$5,2)","v":"12"},null,null,null,null,{"$f":"CONCATENATE(L30,\"         ;\",ROUND(#REF!,0),\"rpm | \",ROUND(F30,1),\"° | \",,ROUND(G30,2),\"ms \")","v":{"$error":"#REF!"}}]
["",45,43.402777777777779,2604,64.004096262160786,19.283899999999996,1.9659562211981572,1965.9562211981572,1575,0,39.375,39.375,"",null,null,null,{"$f":"EEPROM16!O14","v":":10E0A0008C008E00900092009300950097009800D9"},null,{"$f":"EEPROM16!Q14","v":"8C 8E 90 92   93 95 97 98"},null,{"$f":"DEC2HEX(EEPROM16!J$5,2)","v":"14"},null,null,null,null,{"$f":"CONCATENATE(L31,\"         ;\",ROUND(#REF!,0),\"rpm | \",ROUND(F31,1),\"° | \",,ROUND(G31,2),\"ms \")","v":{"$error":"#REF!"}}]
["",46,42.459239130434781,2547,65.436461196178499,18.828060000000001,2.0397814422196041,2039.7814422196043,1649,0,41.225000000000001,41.225000000000001,"","output width",500,"us",{"$f":"EEPROM16!O15","v":":10E0B0009A009C009D009F00A100A300A400000002"},null,{"$f":"EEPROM16!Q15","v":"9A 9C 9D 9F   A1 A3 A4 00"},null,{"$f":"DEC2HEX(EEPROM16!K$5,2)","v":"16"},null,null,null,null,{"$f":"CONCATENATE(L32,\"         ;\",ROUND(#REF!,0),\"rpm | \",ROUND(F32,1),\"° | \",,ROUND(G32,2),\"ms \")","v":{"$error":"#REF!"}}]
["",47,41.555851063829785,2493,66.853857467575878,18.392939999999999,2.1130538842091187,2113.0538842091187,1723,0,43.075000000000003,43.075000000000003,"",null,null,null,{"$f":"EEPROM16!O16","v":":10E0C0000000000000000000000000000000000050"},null,{"$f":"EEPROM16!Q16","v":"00 00 00 00   00 00 00 00"},null,{"$f":"DEC2HEX(EEPROM16!L$5,2)","v":"18"},null,null,null,null,{"$f":"CONCATENATE(L33,\"         ;\",ROUND(#REF!,0),\"rpm | \",ROUND(F33,1),\"° | \",,ROUND(G33,2),\"ms \")","v":{"$error":"#REF!"}}]
["",48,40.690104166666664,2441,68.278028130547597,17.983719999999998,2.1860084664754886,2186.0084664754886,1796,0,44.9,44.9,"",null,null,null,{"$f":"EEPROM16!O17","v":":10E0D000000000000000000000000000000001003F"},null,{"$f":"EEPROM16!Q17","v":"00 00 00 00   00 00 00 01"},null,{"$f":"DEC2HEX(EEPROM16!M$5,2)","v":"1A"},null,null,null,null,{"$f":"CONCATENATE(L34,\"         ;\",ROUND(#REF!,0),\"rpm | \",ROUND(F34,1),\"° | \",,ROUND(G34,2),\"ms \")","v":{"$error":"#REF!"}}]
["",49,39.859693877551024,2391,69.705841349505079,17.595219999999998,2.2588024536456155,2258.8024536456155,1868,0,46.7,46.7,"",null,null,null,{"$f":"EEPROM16!O18","v":":10E0E0004F0007000B003200320002000100140054"},null,{"$f":"EEPROM16!Q18","v":"4F 07 0B 32   32 02 01 14"},null,{"$f":"DEC2HEX(EEPROM16!F$6,2)","v":"1C"},null,null,null,null,{"$f":"CONCATENATE(L35,\"         ;\",ROUND(#REF!,0),\"rpm | \",ROUND(F35,1),\"° | \",,ROUND(G35,2),\"ms \")","v":{"$error":"#REF!"}}]
["",50,39.0625,2343,71.133873950775367,17.227440000000001,2.3312391520842226,2331.2391520842225,1941,0,48.524999999999999,48.524999999999999,"",null,null,null,{"$f":"EEPROM16!O19","v":":10E0F00012000000010008000E0028001700750043"},null,{"$f":"EEPROM16!Q19","v":"12 00 01 08   0E 28 17 75"},null,{"$f":"DEC2HEX(EEPROM16!G$6,2)","v":"1E"},null,null,null,null,{"$f":"CONCATENATE(L36,\"         ;\",ROUND(#REF!,0),\"rpm | \",ROUND(F36,1),\"° | \",,ROUND(G36,2),\"ms \")","v":{"$error":"#REF!"}}]
["",51,38.296568627450981,2297,72.558409519663329,16.8752,2.403482803656944,2403.4828036569438,2013,0,50.325000000000003,50.325000000000003,"",null,null,null,{"$f":"EEPROM16!O20","v":":10E10000FF00FF00FF00FF00FF00FF00FF00FF0017"},null,{"$f":"EEPROM16!Q20","v":"FF FF FF FF   FF FF FF FF"},null,{"$f":"DEC2HEX(EEPROM16!H$6,2)","v":"1F"},null,null,null,null,{"$f":"CONCATENATE(L37,\"         ;\",ROUND(#REF!,0),\"rpm | \",ROUND(F37,1),\"° | \",,ROUND(G37,2),\"ms \")","v":{"$error":"#REF!"}}]
["",52,37.560096153846153,2253,73.975440153868917,16.538499999999999,2.4753291907086852,2475.329190708685,2085,0,52.125,52.125,"","Led blink at startup","yes",{"$f":"IF(O38=\"yes\",1,0)","v":1},{"$f":"EEPROM16!O21","v":":10E11000FF00FF00FF00FF00FF00FF00FF00FF0007"},null,{"$f":"EEPROM16!Q21","v":"FF FF FF FF   FF FF FF FF"},null,{"$f":"DEC2HEX(EEPROM16!I$6,2)","v":"21"},null,null,null,null,{"$f":"CONCATENATE(L38,\"         ;\",ROUND(#REF!,0),\"rpm | \",ROUND(F38,1),\"° | \",,ROUND(G38,2),\"ms \")","v":{"$error":"#REF!"}}]
["",53,36.851415094339622,2211,75.38067239559777,16.21734,2.5465596261118648,2546.5596261118649,2156,0,53.9,53.9,"",null,null,null,{"$f":"EEPROM16!O22","v":":10E12000FF00FF00FF00FF00FF00FF00FF00FF00F7"},null,{"$f":"EEPROM16!Q22","v":"FF FF FF FF   FF FF FF FF"},null,{"$f":"DEC2HEX(EEPROM16!J$6,2)","v":"23"},null,null,null,null,{"$f":"CONCATENATE(L39,\"         ;\",ROUND(#REF!,0),\"rpm | \",ROUND(F39,1),\"° | \",,ROUND(G39,2),\"ms \")","v":{"$error":"#REF!"}}]
["",54,36.168981481481481,2170,76.804915514592935,15.911719999999999,2.6181474654377879,2618.147465437788,2228,0,55.7,55.7,"","reboot en bcl avec output:1000us",null,null,{"$f":"EEPROM16!O23","v":":10E13000FF00FF00FF00FF00FF00FF00FF00FF00E7"},null,{"$f":"EEPROM16!Q23","v":"FF FF FF FF   FF FF FF FF"},null,{"$f":"DEC2HEX(EEPROM16!K$6,2)","v":"25"},null,null,null,null,{"$f":"CONCATENATE(L40,\"         ;\",ROUND(#REF!,0),\"rpm | \",ROUND(F40,1),\"° | \",,ROUND(G40,2),\"ms \")","v":{"$error":"#REF!"}}]
["",55,35.511363636363633,2130,{"$f":"((1000*1000*60)/($O$24*$D41))/360","v":78.247261345852891},15.61646,{"$f":"(E41*($F$5-F41))/1000","v":2.6904178403755865},{"$f":"E41*($F$5-F41)","v":2690.4178403755864},2300,0,57.5,57.5,"","si max rpm < 1000us",null,null,{"$f":"EEPROM16!O24","v":":10E14000FF00FF00FF00FF00FF00FF00FF00FF00D7"},null,{"$f":"EEPROM16!Q24","v":"FF FF FF FF   FF FF FF FF"},null,{"$f":"DEC2HEX(EEPROM16!L$6,2)","v":"27"},null,null,null,null,{"$f":"CONCATENATE(L41,\"         ;\",ROUND(#REF!,0),\"rpm | \",ROUND(F41,1),\"° | \",,ROUND(G41,2),\"ms \")","v":{"$error":"#REF!"}}]
["",56,34.877232142857146,2092,79.668578712555771,15.336739999999999,2.7615726577437858,2761.5726577437858,2371,0,59.274999999999999,59.274999999999999,"",null,null,null,{"$f":"EEPROM16!O25","v":":10E15000FF00FF00FF00FF00FF00FF00FF00FF00C7"},null,{"$f":"EEPROM16!Q25","v":"FF FF FF FF   FF FF FF FF"},null,{"$f":"DEC2HEX(EEPROM16!M$6,2)","v":"29"},null,null,null,null,{"$f":"CONCATENATE(L42,\"         ;\",ROUND(#REF!,0),\"rpm | \",ROUND(F42,1),\"° | \",,ROUND(G42,2),\"ms \")","v":{"$error":"#REF!"}}]
["",57,34.265350877192979,2055,81.103000811030014,15.06738,2.8331403081914033,2833.1403081914032,2443,0,61.075000000000003,61.075000000000003,"",null,null,null,{"$f":"EEPROM16!O26","v":":10E16000FF00FF00FF00FF00FF00FF00FF00FF00B7"},null,{"$f":"EEPROM16!Q26","v":"FF FF FF FF   FF FF FF FF"},null,{"$f":"DEC2HEX(EEPROM16!F$7,2)","v":"2B"},null,null,null,null,{"$f":"CONCATENATE(L43,\"         ;\",ROUND(#REF!,0),\"rpm | \",ROUND(F43,1),\"° | \",,ROUND(G43,2),\"ms \")","v":{"$error":"#REF!"}}]
["",58,33.674568965517238,2020,82.508250825082513,14.80838,2.9035990099009905,2903.5990099009905,2513,0,62.825000000000003,62.825000000000003,"",null,null,null,{"$f":"EEPROM16!O27","v":":10E17000FF00FF00FF00FF00FF00FF00FF00FF00A7"},null,{"$f":"EEPROM16!Q27","v":"FF FF FF FF   FF FF FF FF"},null,{"$f":"DEC2HEX(EEPROM16!G$7,2)","v":"2C"},null,null,null,null,{"$f":"CONCATENATE(L44,\"         ;\",ROUND(#REF!,0),\"rpm | \",ROUND(F44,1),\"° | \",,ROUND(G44,2),\"ms \")","v":{"$error":"#REF!"}}]
["",59,33.103813559322035,1986,83.920778784827121,14.55974,2.9741742195367573,2974.1742195367574,2584,0,64.599999999999994,64.599999999999994,"",null,null,null,{"$f":"EEPROM16!O28","v":":10E18000FF00FF00FF00FF00FF00FF00FF00FF0097"},null,{"$f":"EEPROM16!Q28","v":"FF FF FF FF   FF FF FF FF"},null,{"$f":"DEC2HEX(EEPROM16!H$7,2)","v":"2E"},null,null,null,null,{"$f":"CONCATENATE(L45,\"         ;\",ROUND(#REF!,0),\"rpm | \",ROUND(F45,1),\"° | \",,ROUND(G45,2),\"ms \")","v":{"$error":"#REF!"}}]
["",60,32.552083333333336,1953,85.338795016214362,14.32146,3.0447636115378045,3044.7636115378045,2654,0,66.349999999999994,66.349999999999994,"",null,null,null,{"$f":"EEPROM16!O29","v":":10E19000FF00FF00FF00FF00FF00FF00FF00FF0087"},null,{"$f":"EEPROM16!Q29","v":"FF FF FF FF   FF FF FF FF"},null,{"$f":"DEC2HEX(EEPROM16!I$7,2)","v":"30"},null,null,null,null,{"$f":"CONCATENATE(L46,\"         ;\",ROUND(#REF!,0),\"rpm | \",ROUND(F46,1),\"° | \",,ROUND(G46,2),\"ms \")","v":{"$error":"#REF!"}}]
["",61,32.018442622950822,1921,86.760367863959743,14.093539999999999,3.1152576782925561,3115.2576782925562,2725,0,68.125,68.125,"",null,null,null,{"$f":"EEPROM16!O30","v":":10E1A000FF00FF00FF00FF00FF00FF00FF00FF0077"},null,{"$f":"EEPROM16!Q30","v":"FF FF FF FF   FF FF FF FF"},null,{"$f":"DEC2HEX(EEPROM16!J$7,2)","v":"32"},null,null,null,null,{"$f":"CONCATENATE(L47,\"         ;\",ROUND(#REF!,0),\"rpm | \",ROUND(F47,1),\"° | \",,ROUND(G47,2),\"ms \")","v":{"$error":"#REF!"}}]
["",62,31.50201612903226,1890,88.183421516754848,13.87598,3.1855396825396824,3185.5396825396824,2795,0,69.875,69.875,"",null,null,null,{"$f":"EEPROM16!O31","v":":10E1B000FF00FF00FF00FF00FF00FF00FF00FF0067"},null,{"$f":"EEPROM16!Q31","v":"FF FF FF FF   FF FF FF FF"},null,{"$f":"DEC2HEX(EEPROM16!K$7,2)","v":"34"},null,null,null,null,{"$f":"CONCATENATE(L48,\"         ;\",ROUND(#REF!,0),\"rpm | \",ROUND(F48,1),\"° | \",,ROUND(G48,2),\"ms \")","v":{"$error":"#REF!"}}]
["",63,31.001984126984127,1860,89.605734767025098,13.663599999999999,3.2559498207885302,3255.9498207885304,2865,0,71.625,71.625,"",null,null,null,{"$f":"EEPROM16!O32","v":":10E1C000FF00FF00FF00FF00FF00FF00FF00FF0057"},null,{"$f":"EEPROM16!Q32","v":"FF FF FF FF   FF FF FF FF"},null,{"$f":"DEC2HEX(EEPROM16!L$7,2)","v":"35"},null,null,null,null,{"$f":"CONCATENATE(L49,\"         ;\",ROUND(#REF!,0),\"rpm | \",ROUND(F49,1),\"° | \",,ROUND(G49,2),\"ms \")","v":{"$error":"#REF!"}}]
["",64,30.517578125,1831,91.024940833788463,13.456399999999999,3.3263790278536316,3326.3790278536317,2936,0,73.400000000000006,73.400000000000006,"",null,null,null,{"$f":"EEPROM16!O33","v":":10E1D000FF00FF00FF00FF00FF00FF00FF00FF0047"},null,{"$f":"EEPROM16!Q33","v":"FF FF FF FF   FF FF FF FF"},null,{"$f":"DEC2HEX(EEPROM16!M$7,2)","v":"37"},null,null,null,null,{"$f":"CONCATENATE(L50,\"         ;\",ROUND(#REF!,0),\"rpm | \",ROUND(F50,1),\"° | \",,ROUND(G50,2),\"ms \")","v":{"$error":"#REF!"}}]
["",65,30.048076923076923,1802,92.489826119126903,13.259559999999999,3.3981169071402144,3398.1169071402146,3008,0,75.2,75.2,"",null,null,null,{"$f":"EEPROM16!O34","v":":10E1E000FF00FF00FF00FF00FF00FF00FF00FF0037"},null,{"$f":"EEPROM16!Q34","v":"FF FF FF FF   FF FF FF FF"},null,{"$f":"DEC2HEX(EEPROM16!F$8,2)","v":"39"},null,null,null,null,{"$f":"CONCATENATE(L51,\"         ;\",ROUND(#REF!,0),\"rpm | \",ROUND(F51,1),\"° | \",,ROUND(G51,2),\"ms \")","v":{"$error":"#REF!"}}]
["",66,29.592803030303031,1775,93.896713615023472,13.0679,3.4678028169014081,3467.8028169014083,3077,0,76.924999999999997,76.924999999999997,"",null,null,null,{"$f":"EEPROM16!O35","v":":10E1F000FF00FF00FF00FF00FF00FF00FF00FF0027"},null,{"$f":"EEPROM16!Q35","v":"FF FF FF FF   FF FF FF FF"},null,{"$f":"DEC2HEX(EEPROM16!G$8,2)","v":"3B"},null,null,null,null,{"$f":"CONCATENATE(L52,\"         ;\",ROUND(#REF!,0),\"rpm | \",ROUND(F52,1),\"° | \",,ROUND(G52,2),\"ms \")","v":{"$error":"#REF!"}}]
["",67,29.151119402985074,1749,95.292548122736804,12.8866,3.5366304554983801,3536.6304554983799,3146,0,78.650000000000006,78.650000000000006,"",null,null,null,{"$f":"EEPROM16!O36","v":":00000001FF"},null,null,null,{"$f":"DEC2HEX(EEPROM16!H$8,2)","v":"3D"},null,null,null,null,{"$f":"CONCATENATE(L53,\"         ;\",ROUND(#REF!,0),\"rpm | \",ROUND(F53,1),\"° | \",,ROUND(G53,2),\"ms \")","v":{"$error":"#REF!"}}]
["",68,28.722426470588236,1723,96.730508802476308,12.710479999999999,3.6070342426001165,3607.0342426001166,3217,0,80.424999999999997,80.424999999999997,"",null,null,null,null,null,null,null,{"$f":"DEC2HEX(EEPROM16!I$8,2)","v":"3E"},null,null,null,null,{"$f":"CONCATENATE(L54,\"         ;\",ROUND(#REF!,0),\"rpm | \",ROUND(F54,1),\"° | \",,ROUND(G54,2),\"ms \")","v":{"$error":"#REF!"}}]
["",69,28.306159420289855,1698,98.154691794267762,12.539539999999999,3.6769199057714954,3676.9199057714955,3286,0,82.15,82.15,"",null,null,null,null,null,null,null,{"$f":"DEC2HEX(EEPROM16!J$8,2)","v":"40"},null,null,null,null,{"$f":"CONCATENATE(L55,\"         ;\",ROUND(#REF!,0),\"rpm | \",ROUND(F55,1),\"° | \",,ROUND(G55,2),\"ms \")","v":{"$error":"#REF!"}}]
["",70,27.901785714285715,1674,99.561927518916775,12.37378,3.7461389884508169,3746.1389884508171,3356,0,83.9,83.9,"",null,null,null,null,null,null,null,{"$f":"DEC2HEX(EEPROM16!K$8,2)","v":"42"},null,null,null,null,{"$f":"CONCATENATE(L56,\"         ;\",ROUND(#REF!,0),\"rpm | \",ROUND(F56,1),\"° | \",,ROUND(G56,2),\"ms \")","v":{"$error":"#REF!"}}]
["",71,27.508802816901408,1650,101.010101010101,12.213199999999999,3.8168484848484843,3816.8484848484841,3426,0,85.65,85.65,"",null,null,null,null,null,null,null,{"$f":"DEC2HEX(EEPROM16!L$8,2)","v":"44"},null,null,null,null,{"$f":"CONCATENATE(L57,\"         ;\",ROUND(#REF!,0),\"rpm | \",ROUND(F57,1),\"° | \",,ROUND(G57,2),\"ms \")","v":{"$error":"#REF!"}}]
["",72,27.126736111111111,1627,102.43802499487811,12.0578,3.886724031960664,3886.724031960664,3496,0,87.4,87.4,"",null,null,null,null,null,null,null,{"$f":"DEC2HEX(EEPROM16!M$8,2)","v":"45"},null,null,null,null,{"$f":"CONCATENATE(L58,\"         ;\",ROUND(#REF!,0),\"rpm | \",ROUND(F58,1),\"° | \",,ROUND(G58,2),\"ms \")","v":{"$error":"#REF!"}}]
["",73,26.75513698630137,1605,103.84215991692628,11.907579999999999,3.9555991692627215,3955.5991692627213,3565,0,89.125,89.125,"",null,null,null,null,null,null,null,{"$f":"DEC2HEX(EEPROM16!F$9,2)","v":"47"},null,null,null,null,{"$f":"CONCATENATE(L59,\"         ;\",ROUND(#REF!,0),\"rpm | \",ROUND(F59,1),\"° | \",,ROUND(G59,2),\"ms \")","v":{"$error":"#REF!"}}]
["",74,26.393581081081081,1583,105.28532322594229,11.75736,4.0263887134133496,4026.3887134133497,3636,0,90.9,90.9,"",null,null,null,null,null,null,null,{"$f":"DEC2HEX(EEPROM16!G$9,2)","v":"49"},null,null,null,null,{"$f":"CONCATENATE(L60,\"         ;\",ROUND(#REF!,0),\"rpm | \",ROUND(F60,1),\"° | \",,ROUND(G60,2),\"ms \")","v":{"$error":"#REF!"}}]
["",75,26.041666666666668,1562,106.70081092616304,11.6175,4.0954438753734532,4095.443875373453,3705,0,92.625,92.625,"",null,null,null,null,null,null,null,{"$f":"DEC2HEX(EEPROM16!H$9,2)","v":"4B"},null,null,null,null,{"$f":"CONCATENATE(L61,\"         ;\",ROUND(#REF!,0),\"rpm | \",ROUND(F61,1),\"° | \",,ROUND(G61,2),\"ms \")","v":{"$error":"#REF!"}}]
["",76,25.699013157894736,1541,108.15487778498809,11.48282,4.165820895522387,4165.8208955223872,3775,0,94.375,94.375,"",null,null,null,null,null,null,null,{"$f":"DEC2HEX(EEPROM16!I$9,2)","v":"4C"},null,null,null,null,{"$f":"CONCATENATE(L62,\"         ;\",ROUND(#REF!,0),\"rpm | \",ROUND(F62,1),\"° | \",,ROUND(G62,2),\"ms \")","v":{"$error":"#REF!"}}]
["",77,25.365259740259742,1521,109.57703265395574,11.348139999999999,4.2353561253561258,4235.3561253561256,3845,0,96.125,96.125,"",null,null,null,null,null,null,null,{"$f":"DEC2HEX(EEPROM16!J$9,2)","v":"4E"},null,null,null,null,{"$f":"CONCATENATE(L63,\"         ;\",ROUND(#REF!,0),\"rpm | \",ROUND(F63,1),\"° | \",,ROUND(G63,2),\"ms \")","v":{"$error":"#REF!"}}]
["",78,25.040064102564102,1502,110.96316023080338,11.218639999999999,4.3033022636484697,4303.3022636484693,3913,0,97.825000000000003,97.825000000000003,"",null,null,null,null,null,null,null,{"$f":"DEC2HEX(EEPROM16!K$9,2)","v":"50"},null,null,null,null,{"$f":"CONCATENATE(L64,\"         ;\",ROUND(#REF!,0),\"rpm | \",ROUND(F64,1),\"° | \",,ROUND(G64,2),\"ms \")","v":{"$error":"#REF!"}}]
["",79,24.723101265822784,1483,112.38480557428635,11.09432,4.3724072825354012,4372.4072825354015,3982,0,99.55,99.55,"",null,null,null,null,null,null,null,{"$f":"DEC2HEX(EEPROM16!L$9,2)","v":"52"},null,null,null,null,{"$f":"CONCATENATE(L65,\"         ;\",ROUND(#REF!,0),\"rpm | \",ROUND(F65,1),\"° | \",,ROUND(G65,2),\"ms \")","v":{"$error":"#REF!"}}]
["",80,24.4140625,1464,113.84335154826957,10.969999999999999,4.4433060109289615,4443.3060109289618,4053,0,101.325,101.325,"",null,null,null,null,null,null,null,{"$f":"DEC2HEX(EEPROM16!M$9,2)","v":"53"},null,null,null,null,{"$f":"CONCATENATE(L66,\"         ;\",ROUND(#REF!,0),\"rpm | \",ROUND(F66,1),\"° | \",,ROUND(G66,2),\"ms \")","v":{"$error":"#REF!"}}]
["",81,24.112654320987655,1446,115.2604887044721,10.850859999999999,4.5123490087597968,4512.3490087597966,4122,0,103.05,103.05,"",null,null,null,null,null,null,null,{"$f":"DEC2HEX(EEPROM16!F$10,2)","v":"55"},null,null,null,null,{"$f":"CONCATENATE(L67,\"         ;\",ROUND(#REF!,0),\"rpm | \",ROUND(F67,1),\"° | \",,ROUND(G67,2),\"ms \")","v":{"$error":"#REF!"}}]
["",82,23.818597560975611,1429,116.63167716351761,10.7369,4.5793212036389086,4579.3212036389086,4189,0,104.72499999999999,104.72499999999999,"",null,null,null,null,null,null,null,{"$f":"DEC2HEX(EEPROM16!G$10,2)","v":"57"},null,null,null,null,{"$f":"CONCATENATE(L68,\"         ;\",ROUND(#REF!,0),\"rpm | \",ROUND(F68,1),\"° | \",,ROUND(G68,2),\"ms \")","v":{"$error":"#REF!"}}]
["",83,23.531626506024097,1411,118.11953697141507,10.62294,4.6512000944956302,4651.2000944956299,4261,0,106.52500000000001,106.52500000000001,"",null,null,null,null,null,null,null,{"$f":"DEC2HEX(EEPROM16!H$10,2)","v":"59"},null,null,null,null,{"$f":"CONCATENATE(L69,\"         ;\",ROUND(#REF!,0),\"rpm | \",ROUND(F69,1),\"° | \",,ROUND(G69,2),\"ms \")","v":{"$error":"#REF!"}}]
["",84,23.251488095238095,1395,119.47431302270012,10.51416,4.7175436081242523,4717.5436081242524,4327,0,108.175,108.175,"",null,null,null,null,null,null,null,{"$f":"DEC2HEX(EEPROM16!I$10,2)","v":"5A"},null,null,null,null,{"$f":"CONCATENATE(L70,\"         ;\",ROUND(#REF!,0),\"rpm | \",ROUND(F70,1),\"° | \",,ROUND(G70,2),\"ms \")","v":{"$error":"#REF!"}}]
["",85,22.977941176470587,1378,120.94823415578134,10.405379999999999,4.7888993710691832,4788.899371069183,4398,0,109.95,109.95,"",null,null,null,null,null,null,null,{"$f":"DEC2HEX(EEPROM16!J$10,2)","v":"5C"},null,null,null,null,{"$f":"CONCATENATE(L71,\"         ;\",ROUND(#REF!,0),\"rpm | \",ROUND(F71,1),\"° | \",,ROUND(G71,2),\"ms \")","v":{"$error":"#REF!"}}]
["",86,22.710755813953487,1362,122.36906510034264,10.301780000000001,4.8578340675477243,4857.8340675477239,4467,0,111.675,111.675,"",null,null,null,null,null,null,null,{"$f":"DEC2HEX(EEPROM16!K$10,2)","v":"5E"},null,null,null,null,{"$f":"CONCATENATE(L72,\"         ;\",ROUND(#REF!,0),\"rpm | \",ROUND(F72,1),\"° | \",,ROUND(G72,2),\"ms \")","v":{"$error":"#REF!"}}]
["",87,22.449712643678161,1346,{"$f":"((1000*1000*60)/($O$24*$D73))/360","v":123.82367508667656},10.20336,{"$f":"(E73*($F$5-F73))/1000","v":4.927766220901435},{"$f":"E73*($F$5-F73)","v":4927.7662209014352},{"$f":"IF($H73>$I$5,INT($H73-$I$5),\"0\")","v":4537},0,113.425,113.425,"",null,null,null,null,null,null,null,{"$f":"DEC2HEX(EEPROM16!L$10,2)","v":"60"},null,null,null,null,{"$f":"CONCATENATE(L73,\"         ;\",ROUND(#REF!,0),\"rpm | \",ROUND(F73,1),\"° | \",,ROUND(G73,2),\"ms \")","v":{"$error":"#REF!"}}]
["",88,{"$f":"IFERROR(1000000/(B74*256*($O$30/$C$4)),\"\")","v":22.194602272727273},{"$f":"INT(60*C74*$O$25/2*$O$24)","v":1331},125.21913348359628,10.104939999999999,4.995624843476083,4995.6248434760828,4605,0,{"$f":"IF(($I74/$L$5)-$J74>255,255,IF($I74>0.01,INT($I74-$J74)/$L$5,1))","v":115.125},{"$f":"IF($K74 > 0,$K74,0)","v":115.125},{"$f":"IF($I74/$L$5>255,CONCATENATE(\"WARNING: Timing will be more then \",F74,\"°\"),\"\")","v":""},null,null,null,null,null,null,null,{"$f":"DEC2HEX(EEPROM16!M$10,2)","v":"61"},null,null,null,null,{"$f":"CONCATENATE(L74,\"         ;\",ROUND(#REF!,0),\"rpm | \",ROUND(F74,1),\"° | \",,ROUND(G74,2),\"ms \")","v":{"$error":"#REF!"}}]
[{"$f":"IF($B75>255,CONCATENATE(\"ERROR: Timer1H too large\"),\"\")","v":""},{"$f":"IF((B74+1)<(95+$B$9),B74+1,\"- End -\")","v":89},21.945224719101123,1316,126.64640324214793,10.006519999999998,5.0650303951367786,5065.0303951367787,4675,0,116.875,116.875,"",null,null,null,null,null,null,null,{"$f":"DEC2HEX(EEPROM16!F$11,2)","v":"63"},null,null,null,null,{"$f":"CONCATENATE(L75,\"         ;\",ROUND(#REF!,0),\"rpm | \",ROUND(F75,1),\"° | \",,ROUND(G75,2),\"ms \")","v":{"$error":"#REF!"}}]
["",90,21.701388888888889,1302,128.00819252432157,9.9132800000000003,5.1314285714285717,5131.4285714285716,4741,0,118.52500000000001,118.52500000000001,"",null,null,null,null,null,null,null,{"$f":"DEC2HEX(EEPROM16!G$11,2)","v":"65"},null,null,null,null,{"$f":"CONCATENATE(L76,\"         ;\",ROUND(#REF!,0),\"rpm | \",ROUND(F76,1),\"° | \",,ROUND(G76,2),\"ms \")","v":{"$error":"#REF!"}}]
["",91,21.462912087912088,1287,129.5001295001295,9.8252199999999998,5.2026392126392134,5202.6392126392129,4812,0,120.3,120.3,"",null,null,null,null,null,null,null,{"$f":"DEC2HEX(EEPROM16!H$11,2)","v":"67"},null,null,null,null,{"$f":"CONCATENATE(L77,\"         ;\",ROUND(#REF!,0),\"rpm | \",ROUND(F77,1),\"° | \",,ROUND(G77,2),\"ms \")","v":{"$error":"#REF!"}}]
["",92,21.229619565217391,1273,130.92432573972243,9.7319800000000001,5.2720633673736579,5272.0633673736575,4882,0,122.05,122.05,"",null,null,null,null,null,null,null,{"$f":"DEC2HEX(EEPROM16!I$11,2)","v":"68"},null,null,null,null,{"$f":"CONCATENATE(L78,\"         ;\",ROUND(#REF!,0),\"rpm | \",ROUND(F78,1),\"° | \",,ROUND(G78,2),\"ms \")","v":{"$error":"#REF!"}}]
["",93,21.001344086021504,1260,132.27513227513228,9.6491000000000007,5.3374206349206341,5337.4206349206343,4947,0,123.675,123.675,"",null,null,null,null,null,null,null,{"$f":"DEC2HEX(EEPROM16!J$11,2)","v":"6A"},null,null,null,null,{"$f":"CONCATENATE(L79,\"         ;\",ROUND(#REF!,0),\"rpm | \",ROUND(F79,1),\"° | \",,ROUND(G79,2),\"ms \")","v":{"$error":"#REF!"}}]
["",94,20.777925531914892,1246,133.76136971642589,9.5610399999999984,5.4091706795077581,5409.170679507758,5019,0,125.47499999999999,125.47499999999999,"",null,null,null,null,null,null,null,{"$f":"DEC2HEX(EEPROM16!K$11,2)","v":"6C"},null,null,null,null,{"$f":"CONCATENATE(L80,\"         ;\",ROUND(#REF!,0),\"rpm | \",ROUND(F80,1),\"° | \",,ROUND(G80,2),\"ms \")","v":{"$error":"#REF!"}}]
["",95,20.559210526315791,1233,135.17166801838334,9.478159999999999,5.4774047039740461,5477.4047039740462,5087,0,127.175,127.175,"",null,null,null,null,null,null,null,{"$f":"DEC2HEX(EEPROM16!L$11,2)","v":"6D"},null,null,null,null,{"$f":"CONCATENATE(L81,\"         ;\",ROUND(#REF!,0),\"rpm | \",ROUND(F81,1),\"° | \",,ROUND(G81,2),\"ms \")","v":{"$error":"#REF!"}}]
["",96,20.345052083333332,1220,136.61202185792351,9.3952799999999996,5.5470928961748642,5547.0928961748641,5157,0,128.92500000000001,128.92500000000001,"",null,null,null,null,null,null,null,{"$f":"DEC2HEX(EEPROM16!M$11,2)","v":"6F"},null,null,null,null,{"$f":"CONCATENATE(L82,\"         ;\",ROUND(#REF!,0),\"rpm | \",ROUND(F82,1),\"° | \",,ROUND(G82,2),\"ms \")","v":{"$error":"#REF!"}}]
["",97,20.135309278350515,1208,137.9690949227373,9.3175799999999995,5.6129166666666661,5612.9166666666661,5222,0,130.55000000000001,130.55000000000001,"",null,null,null,null,null,null,null,{"$f":"DEC2HEX(EEPROM16!F$12,2)","v":"71"},null,null,null,null,{"$f":"CONCATENATE(L83,\"         ;\",ROUND(#REF!,0),\"rpm | \",ROUND(F83,1),\"° | \",,ROUND(G83,2),\"ms \")","v":{"$error":"#REF!"}}]
["",98,19.929846938775512,1195,139.47001394700141,9.2398799999999994,5.6848145048814516,5684.8145048814513,5294,0,132.35,132.35,"",null,null,null,null,null,null,null,{"$f":"DEC2HEX(EEPROM16!G$12,2)","v":"73"},null,null,null,null,{"$f":"CONCATENATE(L84,\"         ;\",ROUND(#REF!,0),\"rpm | \",ROUND(F84,1),\"° | \",,ROUND(G84,2),\"ms \")","v":{"$error":"#REF!"}}]
["",99,19.728535353535353,1183,140.88475626937165,9.1673599999999986,5.7526965342349952,5752.6965342349949,5362,0,134.05000000000001,134.05000000000001,"",null,null,null,null,null,null,null,{"$f":"DEC2HEX(EEPROM16!H$12,2)","v":"74"},null,null,null,null,{"$f":"CONCATENATE(L85,\"         ;\",ROUND(#REF!,0),\"rpm | \",ROUND(F85,1),\"° | \",,ROUND(G85,2),\"ms \")","v":{"$error":"#REF!"}}]
["",100,19.53125,1171,142.32849416453172,9.0896599999999985,5.8227070879590093,5822.7070879590092,5432,0,135.80000000000001,135.80000000000001,"",null,null,null,null,null,null,null,{"$f":"DEC2HEX(EEPROM16!I$12,2)","v":"76"},null,null,null,null,{"$f":"CONCATENATE(L86,\"         ;\",ROUND(#REF!,0),\"rpm | \",ROUND(F86,1),\"° | \",,ROUND(G86,2),\"ms \")","v":{"$error":"#REF!"}}]
["",101,19.337871287128714,1160,143.67816091954023,9.0171399999999995,5.8883419540229891,5888.3419540229888,5498,0,137.44999999999999,137.44999999999999,"",null,null,null,null,null,null,null,{"$f":"DEC2HEX(EEPROM16!J$12,2)","v":"78"},null,null,null,null,{"$f":"CONCATENATE(L87,\"         ;\",ROUND(#REF!,0),\"rpm | \",ROUND(F87,1),\"° | \",,ROUND(G87,2),\"ms \")","v":{"$error":"#REF!"}}]
["",102,19.14828431372549,1148,145.18002322880372,8.9497999999999998,5.9596689895470387,5959.668989547039,5569,0,139.22499999999999,139.22499999999999,"",null,null,null,null,null,null,null,{"$f":"DEC2HEX(EEPROM16!K$12,2)","v":"7A"},null,null,null,null,{"$f":"CONCATENATE(L88,\"         ;\",ROUND(#REF!,0),\"rpm | \",ROUND(F88,1),\"° | \",,ROUND(G88,2),\"ms \")","v":{"$error":"#REF!"}}]
["",103,18.962378640776699,1137,146.5845793022574,8.8772799999999989,6.0279566109645266,6027.9566109645266,5637,0,140.92500000000001,140.92500000000001,"",null,null,null,null,null,null,null,{"$f":"DEC2HEX(EEPROM16!L$12,2)","v":"7B"},null,null,null,null,{"$f":"CONCATENATE(L89,\"         ;\",ROUND(#REF!,0),\"rpm | \",ROUND(F89,1),\"° | \",,ROUND(G89,2),\"ms \")","v":{"$error":"#REF!"}}]
["",104,18.780048076923077,1126,148.01657785671995,8.809940000000001,6.0968117229129666,6096.8117229129666,5706,0,142.65,142.65,"",null,null,null,null,null,null,null,{"$f":"DEC2HEX(EEPROM16!M$12,2)","v":"7D"},null,null,null,null,{"$f":"CONCATENATE(L90,\"         ;\",ROUND(#REF!,0),\"rpm | \",ROUND(F90,1),\"° | \",,ROUND(G90,2),\"ms \")","v":{"$error":"#REF!"}}]
["",105,18.601190476190474,1116,149.34289127837513,8.7425999999999995,6.1614994026284347,6161.4994026284348,5771,0,144.27500000000001,144.27500000000001,"",null,null,null,null,null,null,null,{"$f":"DEC2HEX(EEPROM16!F$13,2)","v":"7F"},null,null,null,null,{"$f":"CONCATENATE(L91,\"         ;\",ROUND(#REF!,0),\"rpm | \",ROUND(F91,1),\"° | \",,ROUND(G91,2),\"ms \")","v":{"$error":"#REF!"}}]
["",106,18.425707547169811,1105,150.82956259426848,8.6804400000000008,6.2322111613876316,6232.2111613876314,5842,0,146.05000000000001,146.05000000000001,"",null,null,null,null,null,null,null,{"$f":"DEC2HEX(EEPROM16!G$13,2)","v":"80"},null,null,null,null,{"$f":"CONCATENATE(L92,\"         ;\",ROUND(#REF!,0),\"rpm | \",ROUND(F92,1),\"° | \",,ROUND(G92,2),\"ms \")","v":{"$error":"#REF!"}}]
["",107,18.253504672897197,1095,152.20700152207002,8.6130999999999993,6.2993759512937597,6299.3759512937595,5909,0,147.72499999999999,147.72499999999999,"",null,null,null,null,null,null,null,{"$f":"DEC2HEX(EEPROM16!H$13,2)","v":"82"},null,null,null,null,{"$f":"CONCATENATE(L93,\"         ;\",ROUND(#REF!,0),\"rpm | \",ROUND(F93,1),\"° | \",,ROUND(G93,2),\"ms \")","v":{"$error":"#REF!"}}]
["",108,18.08449074074074,1085,153.60983102918587,8.5509400000000007,6.3669831029185868,6366.9831029185871,5976,0,149.4,149.4,"",null,null,null,null,null,null,null,{"$f":"DEC2HEX(EEPROM16!I$13,2)","v":"84"},null,null,null,null,{"$f":"CONCATENATE(L94,\"         ;\",ROUND(#REF!,0),\"rpm | \",ROUND(F94,1),\"° | \",,ROUND(G94,2),\"ms \")","v":{"$error":"#REF!"}}]
["",109,17.918577981651374,1075,155.03875968992247,8.4887799999999984,6.4358480620155039,6435.8480620155042,6045,0,151.125,151.125,"",null,null,null,null,null,null,null,{"$f":"DEC2HEX(EEPROM16!J$13,2)","v":"86"},null,null,null,null,{"$f":"CONCATENATE(L95,\"         ;\",ROUND(#REF!,0),\"rpm | \",ROUND(F95,1),\"° | \",,ROUND(G95,2),\"ms \")","v":{"$error":"#REF!"}}]
["",110,17.755681818181817,1065,156.49452269170578,8.4317999999999991,6.5051956181533654,6505.1956181533651,6115,0,152.875,152.875,"",null,null,null,null,null,null,null,{"$f":"DEC2HEX(EEPROM16!K$13,2)","v":"87"},null,null,null,null,{"$f":"CONCATENATE(L96,\"         ;\",ROUND(#REF!,0),\"rpm | \",ROUND(F96,1),\"° | \",,ROUND(G96,2),\"ms \")","v":{"$error":"#REF!"}}]
["",111,17.59572072072072,1055,157.9778830963665,8.3696400000000004,6.5766761453396514,6576.6761453396512,6186,0,154.65,154.65,"",null,null,null,null,null,null,null,{"$f":"DEC2HEX(EEPROM16!L$13,2)","v":"89"},null,null,null,null,{"$f":"CONCATENATE(L97,\"         ;\",ROUND(#REF!,0),\"rpm | \",ROUND(F97,1),\"° | \",,ROUND(G97,2),\"ms \")","v":{"$error":"#REF!"}}]
["",112,17.438616071428573,1046,159.33715742511154,8.3126599999999993,6.6423422562141496,6642.3422562141495,6252,0,156.30000000000001,156.30000000000001,"",null,null,null,null,null,null,null,{"$f":"DEC2HEX(EEPROM16!M$13,2)","v":"8B"},null,null,null,null,{"$f":"CONCATENATE(L98,\"         ;\",ROUND(#REF!,0),\"rpm | \",ROUND(F98,1),\"° | \",,ROUND(G98,2),\"ms \")","v":{"$error":"#REF!"}}]
["",113,17.284292035398231,1037,160.72002571520412,8.2556799999999999,6.7091481838637099,6709.1481838637101,6319,0,157.97499999999999,157.97499999999999,"",null,null,null,null,null,null,null,{"$f":"DEC2HEX(EEPROM16!F$14,2)","v":"8C"},null,null,null,null,{"$f":"CONCATENATE(L99,\"         ;\",ROUND(#REF!,0),\"rpm | \",ROUND(F99,1),\"° | \",,ROUND(G99,2),\"ms \")","v":{"$error":"#REF!"}}]
["",114,17.13267543859649,1027,162.28497241155469,8.2038799999999998,6.7828821811100299,6782.8821811100297,6392,0,159.80000000000001,159.80000000000001,"",null,null,null,null,null,null,null,{"$f":"DEC2HEX(EEPROM16!G$14,2)","v":"8E"},null,null,null,null,{"$f":"CONCATENATE(L100,\"         ;\",ROUND(#REF!,0),\"rpm | \",ROUND(F100,1),\"° | \",,ROUND(G100,2),\"ms \")","v":{"$error":"#REF!"}}]
["",115,16.983695652173914,1019,163.55904481517828,8.1468999999999987,6.8454530585541375,6845.4530585541379,6455,0,161.375,161.375,"",null,null,null,null,null,null,null,{"$f":"DEC2HEX(EEPROM16!H$14,2)","v":"90"},null,null,null,null,{"$f":"CONCATENATE(L101,\"         ;\",ROUND(#REF!,0),\"rpm | \",ROUND(F101,1),\"° | \",,ROUND(G101,2),\"ms \")","v":{"$error":"#REF!"}}]
["",116,16.837284482758619,1010,165.01650165016503,8.0950999999999986,6.915,6915,6525,0,163.125,163.125,"",null,null,null,null,null,null,null,{"$f":"DEC2HEX(EEPROM16!I$14,2)","v":"92"},null,null,null,null,{"$f":"CONCATENATE(L102,\"         ;\",ROUND(#REF!,0),\"rpm | \",ROUND(F102,1),\"° | \",,ROUND(G102,2),\"ms \")","v":{"$error":"#REF!"}}]
["",117,16.693376068376068,1001,166.5001665001665,8.0432999999999986,6.9857975357975359,6985.7975357975356,6595,0,164.875,164.875,"",null,null,null,null,null,null,null,{"$f":"DEC2HEX(EEPROM16!J$14,2)","v":"93"},null,null,null,null,{"$f":"CONCATENATE(L103,\"         ;\",ROUND(#REF!,0),\"rpm | \",ROUND(F103,1),\"° | \",,ROUND(G103,2),\"ms \")","v":{"$error":"#REF!"}}]
[null,null,null,null,null,null,null,null,null,null,null,null,null,null,null,null,null,null,null,null,{"$f":"DEC2HEX(EEPROM16!K$14,2)","v":"95"},null,null,null,null,{"$f":"CONCATENATE(L104,\"         ;\",ROUND(#REF!,0),\"rpm | \",ROUND(F104,1),\"° | \",,ROUND(G104,2),\"ms \")","v":{"$error":"#REF!"}}]
[null,null,null,null,null,null,null,null,null,null,null,null,null,null,null,null,null,null,null,null,{"$f":"DEC2HEX(EEPROM16!L$14,2)","v":"97"}]
[null,null,null,null,null,null,null,null,null,null,null,null,null,null,null,null,null,null,null,null,{"$f":"DEC2HEX(EEPROM16!M$14,2)","v":"98"}]
[null,null,null,null,null,null,null,null,null,null,null,null,null,null,null,null,null,null,null,null,{"$f":"DEC2HEX(EEPROM16!F$15,2)","v":"9A"}]
[null,null,null,null,null,null,null,null,null,null,null,null,null,null,null,null,null,null,null,null,{"$f":"DEC2HEX(EEPROM16!G$15,2)","v":"9C"}]
[null,null,null,null,null,null,null,null,null,null,null,null,null,null,null,null,null,null,null,null,{"$f":"DEC2HEX(EEPROM16!H$15,2)","v":"9D"}]
[null,null,null,null,null,null,null,null,null,null,null,null,null,null,null,null,null,null,null,null,{"$f":"DEC2HEX(EEPROM16!I$15,2)","v":"9F"}]
[null,null,null,null,null,null,null,null,null,null,null,null,null,null,null,null,null,null,null,null,{"$f":"DEC2HEX(EEPROM16!J$15,2)","v":"A1"}]
[null,null,null,null,null,null,null,null,null,null,null,null,null,null,null,null,null,null,null,null,{"$f":"DEC2HEX(EEPROM16!K$15,2)","v":"A3"}]
[null,null,null,null,null,null,null,null,null,null,null,null,null,null,null,null,null,null,null,null,{"$f":"DEC2HEX(EEPROM16!L$15,2)","v":"A4"}]
[null,null,null,null,null,null,null,null,null,null,null,null,null,null,null,null,null,null,null,null,{"$f":"DEC2HEX(EEPROM16!M$15,2)","v":"00"}]
[null,null,null,null,null,null,null,null,null,null,null,null,null,null,null,null,null,null,null,null,{"$f":"DEC2HEX(EEPROM16!F$16,2)","v":"00"}]
[null,null,null,null,null,null,null,null,null,null,null,null,null,null,null,null,null,null,null,null,{"$f":"DEC2HEX(EEPROM16!G$16,2)","v":"00"}]
[null,null,null,null,null,null,null,null,null,null,null,null,null,null,null,null,null,null,null,null,{"$f":"DEC2HEX(EEPROM16!H$16,2)","v":"00"}]
[null,null,null,null,null,null,null,null,null,null,null,null,null,null,null,null,null,null,null,null,{"$f":"DEC2HEX(EEPROM16!I$16,2)","v":"00"}]
[null,null,null,null,null,null,null,null,null,null,null,null,null,null,null,null,null,null,null,null,{"$f":"DEC2HEX(EEPROM16!J$16,2)","v":"00"}]
[null,null,null,null,null,null,null,null,null,null,null,null,null,null,null,null,null,null,null,null,{"$f":"DEC2HEX(EEPROM16!K$16,2)","v":"00"}]
[null,null,null,null,null,null,null,null,null,null,null,null,null,null,null,null,null,null,null,null,{"$f":"DEC2HEX(EEPROM16!L$16,2)","v":"00"}]
[null,null,null,null,null,null,null,null,null,null,null,null,null,null,null,null,null,null,null,null,{"$f":"DEC2HEX(EEPROM16!M$16,2)","v":"00"}]
[null,null,null,null,null,null,null,null,null,null,null,null,null,null,null,null,null,null,null,null,{"$f":"DEC2HEX(EEPROM16!F$17,2)","v":"00"}]
[null,null,null,null,null,null,null,null,null,null,null,null,null,null,null,null,null,null,null,null,{"$f":"DEC2HEX(EEPROM16!G$17,2)","v":"00"}]
[null,null,null,null,null,null,null,null,null,null,null,null,null,null,null,null,null,null,null,null,{"$f":"DEC2HEX(EEPROM16!H$17,2)","v":"00"}]
[null,null,null,null,null,null,null,null,null,null,null,null,null,null,null,null,null,null,null,null,{"$f":"DEC2HEX(EEPROM16!I$17,2)","v":"00"}]
[null,null,null,null,null,null,null,null,null,null,null,null,null,null,null,null,null,null,null,null,{"$f":"DEC2HEX(EEPROM16!J$17,2)","v":"00"}]
[null,null,null,null,null,null,null,null,null,null,null,null,null,null,null,null,null,null,null,null,{"$f":"DEC2HEX(EEPROM16!K$17,2)","v":"00"}]
[null,null,null,null,null,null,null,null,null,null,null,null,null,null,null,null,null,null,null,null,{"$f":"DEC2HEX(EEPROM16!L$17,2)","v":"00"}]
[null,null,null,null,null,null,null,null,null,null,null,null,null,null,null,null,null,null,null,null,{"$f":"DEC2HEX(EEPROM16!M$17,2)","v":"01"}]
[null,null,null,null,null,null,null,null,null,null,null,null,null,null,null,null,null,null,null,null,{"$f":"DEC2HEX(EEPROM16!F$18,2)","v":"4F"}]
[null,null,null,null,null,null,null,null,null,null,null,null,null,null,null,null,null,null,null,null,{"$f":"DEC2HEX(EEPROM16!G$18,2)","v":"07"}]
[null,null,null,null,null,null,null,null,null,null,null,null,null,null,null,null,null,null,null,null,{"$f":"DEC2HEX(EEPROM16!H$18,2)","v":"0B"}]
[null,null,null,null,null,null,null,null,null,null,null,null,null,null,null,null,null,null,null,null,{"$f":"DEC2HEX(EEPROM16!I$18,2)","v":"32"}]
[null,null,null,null,null,null,null,null,null,null,null,null,null,null,null,null,null,null,null,null,{"$f":"DEC2HEX(EEPROM16!J$18,2)","v":"32"}]
[null,null,null,null,null,null,null,null,null,null,null,null,null,null,null,null,null,null,null,null,{"$f":"DEC2HEX(EEPROM16!K$18,2)","v":"02"}]
[null,null,null,null,null,null,null,null,null,null,null,null,null,null,null,null,null,null,null,null,{"$f":"DEC2HEX(EEPROM16!L$18,2)","v":"01"}]
[null,null,null,null,null,null,null,null,null,null,null,null,null,null,null,null,null,null,null,null,{"$f":"DEC2HEX(EEPROM16!M$18,2)","v":"14"}]
[null,null,null,null,null,null,null,null,null,null,null,null,null,null,null,null,null,null,null,null,{"$f":"DEC2HEX(EEPROM16!F$19,2)","v":"12"}]
[null,null,null,null,null,null,null,null,null,null,null,null,null,null,null,null,null,null,null,null,{"$f":"DEC2HEX(EEPROM16!G$19,2)","v":"00"}]
[null,null,null,null,null,null,null,null,null,null,null,null,null,null,null,null,null,null,null,null,{"$f":"DEC2HEX(EEPROM16!H$19,2)","v":"01"}]
[null,null,null,null,null,null,null,null,null,null,null,null,null,null,null,null,null,null,null,null,{"$f":"DEC2HEX(EEPROM16!I$19,2)","v":"08"}]
[null,null,null,null,null,null,null,null,null,null,null,null,null,null,null,null,null,null,null,null,{"$f":"DEC2HEX(EEPROM16!J$19,2)","v":"0E"}]
[null,null,null,null,null,null,null,null,null,null,null,null,null,null,null,null,null,null,null,null,{"$f":"DEC2HEX(EEPROM16!K$19,2)","v":"28"}]
[null,null,null,null,null,null,null,null,null,null,null,null,null,null,null,null,null,null,null,null,{"$f":"DEC2HEX(EEPROM16!L$19,2)","v":"17"}]
[null,null,null,null,null,null,null,null,null,null,null,null,null,null,null,null,null,null,null,null,{"$f":"DEC2HEX(EEPROM16!M$19,2)","v":"75"}]
[]
[]
[]
[]
[]
[]
[]
[]
[]
[]
[]
[]
[]
[]
[]
[]
[]
[]
[]
[]
[]
[]
[]
[]
[]
[]
[]
[]
[null,{"$f":"IFERROR(B9,\"\")","v":23},{"$f":"IFERROR(D9,\"\")","v":5095},{"$f":"IFERROR(C9,\"\")","v":84.918478260869563}]
[null,{"$f":"IFERROR(B10,\"\")","v":24},4882,81.380208333333329]
[null,{"$f":"IFERROR(B11,\"\")","v":25},4687,78.125]
[null,{"$f":"IFERROR(B12,\"\")","v":26},4507,75.120192307692307]
[null,{"$f":"IFERROR(B13,\"\")","v":27},4340,72.337962962962962]
[null,{"$f":"IFERROR(B14,\"\")","v":28},4185,69.754464285714292]
[null,{"$f":"IFERROR(B15,\"\")","v":29},4040,67.349137931034477]
[null,{"$f":"IFERROR(B16,\"\")","v":30},3906,65.104166666666671]
[null,{"$f":"IFERROR(B17,\"\")","v":31},3780,63.00403225806452]
[null,{"$f":"IFERROR(B18,\"\")","v":32},3662,61.03515625]
[null,{"$f":"IFERROR(B19,\"\")","v":33},3551,59.185606060606062]
[null,{"$f":"IFERROR(B20,\"\")","v":34},3446,57.444852941176471]
[null,{"$f":"IFERROR(B21,\"\")","v":35},3348,55.803571428571431]
[null,{"$f":"IFERROR(B22,\"\")","v":36},3255,54.253472222222221]
[null,{"$f":"IFERROR(B23,\"\")","v":37},3167,52.787162162162161]
[null,{"$f":"IFERROR(B24,\"\")","v":38},3083,51.398026315789473]
[null,{"$f":"IFERROR(B25,\"\")","v":39},3004,50.080128205128204]
[null,{"$f":"IFERROR(B26,\"\")","v":40},2929,48.828125]
[null,{"$f":"IFERROR(B27,\"\")","v":41},2858,47.637195121951223]
[null,{"$f":"IFERROR(B28,\"\")","v":42},2790,46.50297619047619]
[null,{"$f":"IFERROR(B29,\"\")","v":43},2725,45.421511627906973]
[null,{"$f":"IFERROR(B30,\"\")","v":44},2663,44.389204545454547]
[null,{"$f":"IFERROR(B31,\"\")","v":45},2604,43.402777777777779]
[null,{"$f":"IFERROR(B32,\"\")","v":46},2547,42.459239130434781]
[null,{"$f":"IFERROR(B33,\"\")","v":47},2493,41.555851063829785]
[null,{"$f":"IFERROR(B34,\"\")","v":48},2441,40.690104166666664]
[null,{"$f":"IFERROR(B35,\"\")","v":49},2391,39.859693877551024]
[null,{"$f":"IFERROR(B36,\"\")","v":50},2343,39.0625]
[null,{"$f":"IFERROR(B37,\"\")","v":51},2297,38.296568627450981]
[null,{"$f":"IFERROR(B38,\"\")","v":52},2253,37.560096153846153]
[null,{"$f":"IFERROR(B39,\"\")","v":53},2211,36.851415094339622]
[null,{"$f":"IFERROR(B40,\"\")","v":54},2170,36.168981481481481]
[null,{"$f":"IFERROR(B41,\"\")","v":55},{"$f":"IFERROR(D41,\"\")","v":2130},{"$f":"IFERROR(C41,\"\")","v":35.511363636363633}]
[null,{"$f":"IFERROR(B42,\"\")","v":56},2092,34.877232142857146]
[null,{"$f":"IFERROR(B43,\"\")","v":57},2055,34.265350877192979]
[null,{"$f":"IFERROR(B44,\"\")","v":58},2020,33.674568965517238]
[null,{"$f":"IFERROR(B45,\"\")","v":59},1986,33.103813559322035]
[null,{"$f":"IFERROR(B46,\"\")","v":60},1953,32.552083333333336]
[null,{"$f":"IFERROR(B47,\"\")","v":61},1921,32.018442622950822]
[null,{"$f":"IFERROR(B48,\"\")","v":62},1890,31.50201612903226]
[null,{"$f":"IFERROR(B49,\"\")","v":63},1860,31.001984126984127]
[null,{"$f":"IFERROR(B50,\"\")","v":64},1831,30.517578125]
[null,{"$f":"IFERROR(B51,\"\")","v":65},1802,30.048076923076923]
[null,{"$f":"IFERROR(B52,\"\")","v":66},1775,29.592803030303031]
[null,{"$f":"IFERROR(B53,\"\")","v":67},1749,29.151119402985074]
[null,{"$f":"IFERROR(B54,\"\")","v":68},1723,28.722426470588236]
[null,{"$f":"IFERROR(B55,\"\")","v":69},1698,28.306159420289855]
[null,{"$f":"IFERROR(B56,\"\")","v":70},1674,27.901785714285715]
[null,{"$f":"IFERROR(B57,\"\")","v":71},1650,27.508802816901408]
[null,{"$f":"IFERROR(B58,\"\")","v":72},1627,27.126736111111111]
[null,{"$f":"IFERROR(B59,\"\")","v":73},1605,26.75513698630137]
[null,{"$f":"IFERROR(B60,\"\")","v":74},1583,26.393581081081081]
[null,{"$f":"IFERROR(B61,\"\")","v":75},1562,26.041666666666668]
[null,{"$f":"IFERROR(B62,\"\")","v":76},1541,25.699013157894736]
[null,{"$f":"IFERROR(B63,\"\")","v":77},1521,25.365259740259742]
[null,{"$f":"IFERROR(B64,\"\")","v":78},1502,25.040064102564102]
[null,{"$f":"IFERROR(B65,\"\")","v":79},1483,24.723101265822784]
[null,{"$f":"IFERROR(B66,\"\")","v":80},1464,24.4140625]
[null,{"$f":"IFERROR(B67,\"\")","v":81},1446,24.112654320987655]
[null,{"$f":"IFERROR(B68,\"\")","v":82},1429,23.818597560975611]
[null,{"$f":"IFERROR(B69,\"\")","v":83},1411,23.531626506024097]
[null,{"$f":"IFERROR(B70,\"\")","v":84},1395,23.251488095238095]
[null,{"$f":"IFERROR(B71,\"\")","v":85},1378,22.977941176470587]
[null,{"$f":"IFERROR(B72,\"\")","v":86},1362,22.710755813953487]
[null,{"$f":"IFERROR(B73,\"\")","v":87},{"$f":"IFERROR(D73,\"\")","v":1346},{"$f":"IFERROR(C73,\"\")","v":22.449712643678161}]
[null,{"$f":"IFERROR(B74,\"\")","v":88},1331,22.194602272727273]
[null,{"$f":"IFERROR(B75,\"\")","v":89},1316,21.945224719101123]
[null,{"$f":"IFERROR(B76,\"\")","v":90},1302,21.701388888888889]
[null,{"$f":"IFERROR(B77,\"\")","v":91},1287,21.462912087912088]
[null,{"$f":"IFERROR(B78,\"\")","v":92},1273,21.229619565217391]
[null,{"$f":"IFERROR(B79,\"\")","v":93},1260,21.001344086021504]
[null,{"$f":"IFERROR(B80,\"\")","v":94},1246,20.777925531914892]
[null,{"$f":"IFERROR(B81,\"\")","v":95},1233,20.559210526315791]
[null,{"$f":"IFERROR(B82,\"\")","v":96},1220,20.345052083333332]
[null,{"$f":"IFERROR(B83,\"\")","v":97},1208,20.135309278350515]
[null,{"$f":"IFERROR(B84,\"\")","v":98},1195,19.929846938775512]
[null,{"$f":"IFERROR(B85,\"\")","v":99},1183,19.728535353535353]
[null,{"$f":"IFERROR(B86,\"\")","v":100},1171,19.53125]
[null,{"$f":"IFERROR(B87,\"\")","v":101},1160,19.337871287128714]
[null,{"$f":"IFERROR(B88,\"\")","v":102},1148,19.14828431372549]
[null,{"$f":"IFERROR(B89,\"\")","v":103},1137,18.962378640776699]
[null,{"$f":"IFERROR(B90,\"\")","v":104},1126,18.780048076923077]
[null,{"$f":"IFERROR(B91,\"\")","v":105},1116,18.601190476190474]
[null,{"$f":"IFERROR(B92,\"\")","v":106},1105,18.425707547169811]
[null,{"$f":"IFERROR(B93,\"\")","v":107},1095,18.253504672897197]
[null,{"$f":"IFERROR(B94,\"\")","v":108},1085,18.08449074074074]
[null,{"$f":"IFERROR(B95,\"\")","v":109},1075,17.918577981651374]
[null,{"$f":"IFERROR(B96,\"\")","v":110},1065,17.755681818181817]
[null,{"$f":"IFERROR(B97,\"\")","v":111},1055,17.59572072072072]
[null,{"$f":"IFERROR(B98,\"\")","v":112},1046,17.438616071428573]
[null,{"$f":"IFERROR(B99,\"\")","v":113},1037,17.284292035398231]
[null,{"$f":"IFERROR(B100,\"\")","v":114},1027,17.13267543859649]
[null,{"$f":"IFERROR(B101,\"\")","v":115},1019,16.983695652173914]
[null,{"$f":"IFERROR(B102,\"\")","v":116},1010,16.837284482758619]
[null,{"$f":"IFERROR(B103,\"\")","v":117},1001,16.693376068376068]
[null,{"$f":"IFERROR(B104,\"\")","v":0},0,{"$f":"IFERROR(#REF!,\"\")","v":""}]
[null,{"$f":"IFERROR(B105,\"\")","v":0},{"$f":"IFERROR(D105,\"\")","v":0},{"$f":"IFERROR(#REF!,\"\")","v":""}]
[null,{"$f":"IFERROR(B106,\"\")","v":0},0,{"$f":"IFERROR(#REF!,\"\")","v":""}]
[null,{"$f":"IFERROR(B107,\"\")","v":0},0,{"$f":"IFERROR(#REF!,\"\")","v":""}]
[null,{"$f":"IFERROR(B108,\"\")","v":0},0,{"$f":"IFERROR(#REF!,\"\")","v":""}]
[null,{"$f":"IFERROR(B109,\"\")","v":0},0,{"$f":"IFERROR(#REF!,\"\")","v":""}]
[null,{"$f":"IFERROR(B110,\"\")","v":0},0,{"$f":"IFERROR(#REF!,\"\")","v":""}]
[null,{"$f":"IFERROR(B111,\"\")","v":0},0,{"$f":"IFERROR(#REF!,\"\")","v":""}]
[null,{"$f":"IFERROR(B112,\"\")","v":0},0,{"$f":"IFERROR(#REF!,\"\")","v":""}]
[null,{"$f":"IFERROR(B113,\"\")","v":0},0,{"$f":"IFERROR(#REF!,\"\")","v":""}]
[null,{"$f":"IFERROR(B114,\"\")","v":0},0,{"$f":"IFERROR(#REF!,\"\")","v":""}]
[null,{"$f":"IFERROR(B115,\"\")","v":0},0,{"$f":"IFERROR(#REF!,\"\")","v":""}]
[null,{"$f":"IFERROR(B116,\"\")","v":0},0,{"$f":"IFERROR(#REF!,\"\")","v":""}]
[null,{"$f":"IFERROR(B117,\"\")","v":0},0,{"$f":"IFERROR(#REF!,\"\")","v":""}]
[null,{"$f":"IFERROR(B118,\"\")","v":0},0,{"$f":"IFERROR(#REF!,\"\")","v":""}]
[null,{"$f":"IFERROR(B119,\"\")","v":0},0,{"$f":"IFERROR(#REF!,\"\")","v":""}]
[null,{"$f":"IFERROR(B120,\"\")","v":0},0,{"$f":"IFERROR(#REF!,\"\")","v":""}]
[null,{"$f":"IFERROR(B121,\"\")","v":0},0,{"$f":"IFERROR(#REF!,\"\")","v":""}]
[null,{"$f":"IFERROR(B122,\"\")","v":0},0,{"$f":"IFERROR(#REF!,\"\")","v":""}]
[null,{"$f":"IFERROR(B123,\"\")","v":0},0,{"$f":"IFERROR(#REF!,\"\")","v":""}]
[null,{"$f":"IFERROR(B124,\"\")","v":0},0,{"$f":"IFERROR(#REF!,\"\")","v":""}]
[null,{"$f":"IFERROR(B125,\"\")","v":0},0,{"$f":"IFERROR(#REF!,\"\")","v":""}]
[null,{"$f":"IFERROR(B126,\"\")","v":0},0,{"$f":"IFERROR(#REF!,\"\")","v":""}]
[null,{"$f":"IFERROR(B127,\"\")","v":0},0,{"$f":"IFERROR(#REF!,\"\")","v":""}]
[null,{"$f":"IFERROR(B128,\"\")","v":0},0,{"$f":"IFERROR(#REF!,\"\")","v":""}]
[null,{"$f":"IFERROR(B129,\"\")","v":0},0,{"$f":"IFERROR(#REF!,\"\")","v":""}]
[null,{"$f":"IFERROR(B130,\"\")","v":0},0,{"$f":"IFERROR(#REF!,\"\")","v":""}]
[null,{"$f":"IFERROR(B131,\"\")","v":0},0,{"$f":"IFERROR(#REF!,\"\")","v":""}]
[null,{"$f":"IFERROR(B132,\"\")","v":0},0,{"$f":"IFERROR(#REF!,\"\")","v":""}]
[null,{"$f":"IFERROR(B133,\"\")","v":0},0,{"$f":"IFERROR(#REF!,\"\")","v":""}]
[null,{"$f":"IFERROR(B134,\"\")","v":0},0,{"$f":"IFERROR(#REF!,\"\")","v":""}]
[null,{"$f":"IFERROR(B135,\"\")","v":0},0,{"$f":"IFERROR(#REF!,\"\")","v":""}]
[null,{"$f":"IFERROR(B136,\"\")","v":0},0,{"$f":"IFERROR(#REF!,\"\")","v":""}]
[null,{"$f":"IFERROR(B137,\"\")","v":0},{"$f":"IFERROR(D137,\"\")","v":0},{"$f":"IFERROR(#REF!,\"\")","v":""}]
[null,{"$f":"IFERROR(B138,\"\")","v":0},0,{"$f":"IFERROR(#REF!,\"\")","v":""}]
[null,{"$f":"IFERROR(B139,\"\")","v":0},0,{"$f":"IFERROR(#REF!,\"\")","v":""}]
[null,{"$f":"IFERROR(B140,\"\")","v":0},0,{"$f":"IFERROR(#REF!,\"\")","v":""}]
[null,{"$f":"IFERROR(B141,\"\")","v":0},0,{"$f":"IFERROR(#REF!,\"\")","v":""}]
[null,{"$f":"IFERROR(B142,\"\")","v":0},0,{"$f":"IFERROR(#REF!,\"\")","v":""}]
[null,{"$f":"IFERROR(B143,\"\")","v":0},0,{"$f":"IFERROR(#REF!,\"\")","v":""}]
[null,{"$f":"IFERROR(B144,\"\")","v":0},0,{"$f":"IFERROR(#REF!,\"\")","v":""}]
[null,{"$f":"IFERROR(B145,\"\")","v":0},0,{"$f":"IFERROR(#REF!,\"\")","v":""}]
[null,{"$f":"IFERROR(B146,\"\")","v":0},0,{"$f":"IFERROR(#REF!,\"\")","v":""}]
[null,{"$f":"IFERROR(B147,\"\")","v":0},0,{"$f":"IFERROR(#REF!,\"\")","v":""}]
[null,{"$f":"IFERROR(B148,\"\")","v":0},0,{"$f":"IFERROR(#REF!,\"\")","v":""}]
[null,{"$f":"IFERROR(B149,\"\")","v":0},0,{"$f":"IFERROR(#REF!,\"\")","v":""}]
[null,{"$f":"IFERROR(B150,\"\")","v":0},0,{"$f":"IFERROR(#REF!,\"\")","v":""}]
[null,{"$f":"IFERROR(B151,\"\")","v":0},0,{"$f":"IFERROR(#REF!,\"\")","v":""}]
[null,{"$f":"IFERROR(B152,\"\")","v":0},0,{"$f":"IFERROR(#REF!,\"\")","v":""}]
[null,{"$f":"IFERROR(B153,\"\")","v":0},0,{"$f":"IFERROR(#REF!,\"\")","v":""}]
[null,{"$f":"IFERROR(B154,\"\")","v":0},0,{"$f":"IFERROR(#REF!,\"\")","v":""}]
[null,{"$f":"IFERROR(B155,\"\")","v":0},0,{"$f":"IFERROR(#REF!,\"\")","v":""}]
[null,{"$f":"IFERROR(B156,\"\")","v":0},0,{"$f":"IFERROR(#REF!,\"\")","v":""}]
[null,{"$f":"IFERROR(B157,\"\")","v":0},0,{"$f":"IFERROR(#REF!,\"\")","v":""}]
[null,{"$f":"IFERROR(B158,\"\")","v":0},0,{"$f":"IFERROR(#REF!,\"\")","v":""}]
[null,{"$f":"IFERROR(B159,\"\")","v":0},0,{"$f":"IFERROR(#REF!,\"\")","v":""}]
[null,{"$f":"IFERROR(B160,\"\")","v":0},0,{"$f":"IFERROR(#REF!,\"\")","v":""}]
[null,{"$f":"IFERROR(B161,\"\")","v":0},0,{"$f":"IFERROR(#REF!,\"\")","v":""}]
[null,{"$f":"IFERROR(B162,\"\")","v":0},0,{"$f":"IFERROR(#REF!,\"\")","v":""}]
[null,{"$f":"IFERROR(B163,\"\")","v":0},0,{"$f":"IFERROR(#REF!,\"\")","v":""}]
[null,{"$f":"IFERROR(B164,\"\")","v":0},0,{"$f":"IFERROR(#REF!,\"\")","v":""}]
[null,{"$f":"IFERROR(B165,\"\")","v":0},0,{"$f":"IFERROR(#REF!,\"\")","v":""}]
[null,{"$f":"IFERROR(B166,\"\")","v":0},0,{"$f":"IFERROR(#REF!,\"\")","v":""}]
[null,{"$f":"IFERROR(B167,\"\")","v":0},0,{"$f":"IFERROR(#REF!,\"\")","v":""}]
[null,{"$f":"IFERROR(B168,\"\")","v":0},0,{"$f":"IFERROR(#REF!,\"\")","v":""}]
[null,{"$f":"IFERROR(B169,\"\")","v":0},{"$f":"IFERROR(D169,\"\")","v":0},{"$f":"IFERROR(#REF!,\"\")","v":""}]

{"sheet":"advance_at_lowRPM","index":2,"n_rows":49,"n_cols":26,"rows_kept":49,"cut":false,"hidden":false,"merged":[[0,6,0,7]]}
[null,null,null,null,null,null,"delay =",null,4.4000000000000004,"us"]
[null,"Advance at low RPM",null,{"$f":"CONCATENATE(\"from \",Z7,\" to\")","v":"from 480 to"},{"$f":"CONCATENATE(ROUNDDOWN(Advance_curve!D103,0),\" RPM\")","v":"1001 RPM"},null,null,"multiplier",14,null,null,null,null,null,{"$f":"Advance_curve!$F$5","v":50},"pickup pos"]
[null,null,null,null,null,null,null,null,null,null,null,null,null,null,{"$f":"Advance_curve!$B9","v":23},"tmr count min"]
[null,null,null,null,null,null,null,"Prescaler =",{"$f":"Advance_curve!O30","v":8},null,null,null,null,null,null,null,null,null,null,null,null,null,{"$f":"IF(R8<255,\"=(360000/P8)*T8\",0)","v":0}]
[null,null,null,null,null,null,null,"Cylinder(s) =",{"$f":"Advance_curve!O24","v":1}]
[null,null,null,null,null,null,null,"Strokes =",{"$f":"Advance_curve!O25","v":2},null,null,null,null,"Frq","RPM","periode","periode","timer1","TMR1h","Delay","1°","Avance","Avance",null,null,"Mini:"]
[null,null,null,null,null,null,null,"RPM mini =",{"$f":"IF(Advance_curve!O30=1,\"336\",IF(Advance_curve!O30=2,\"168\",IF(Advance_curve!O30=4,\"84\",IF(Advance_curve!O30=8,\"42\",\"False\"))))","v":"42"},null,null,null,null,"Hz",null,"µs","ms",null,null,"µs","us","degres","degres",null,null,{"$f":"MIN(Z8:Z49)","v":480}]
[null,null,null,null,null,null,null,null,null,null,null,null,null,1,{"$f":"IF(N8=\"End\",\" \",(N8*60*$I$6)/(2*$I$5))","v":60},{"$f":"1000000/N8","v":1000000},{"$f":"P8/1000","v":1000},{"$f":"IF(N8=\"End\",\" \",INT(P8*Advance_curve!$C$4)/$I$4)","v":500000},{"$f":"IF(N8=\"End\",\" \",R8/255)","v":1960.7843137254902},{"$f":" ($I$1 *$S8*$I$2)","v":120784.31372549021},{"$f":"P8/360","v":2777.7777777777778},{"$f":"T8/U8","v":43.482352941176472},{"$f":"IF($S8<255,Advance_curve!$F$5-V8,\"0\")","v":"0"},{"$f":"IF($S8<255,\" \",\"TMR1h>255\")","v":"TMR1h>255"},null,{"$f":"IF($S8<255,O8,\" \")","v":" "}]
[null,null,null,null,null,null,null,null,null,null,null,null,null,{"$f":"IF(N8<Advance_curve!$C$103,N8+1,\"End\")","v":2},120,{"$f":"1000000/N9","v":500000},{"$f":"P9/1000","v":500},{"$f":"IF(N9=\"End\",\" \",INT(P9*Advance_curve!$C$4)/$I$4)","v":250000},{"$f":"IF(N9=\"End\",\" \",R9/255)","v":980.39215686274508},{"$f":" ($I$1 *$S9*$I$2)","v":60392.156862745105},1388.8888888888889,{"$f":"T9/U9","v":43.482352941176472},{"$f":"IF($S9<255,Advance_curve!$F$5-V9,\"0\")","v":"0"},{"$f":"IF($S9<255,\" \",\"TMR1h>255\")","v":"TMR1h>255"},null," "]
[null,null,null,null,null,null,null,null,null,null,null,null,null,{"$f":"IF(N9<Advance_curve!$C$103,N9+1,\"End\")","v":3},180,333333.33333333331,333.33333333333331,{"$f":"IF(N10=\"End\",\" \",INT(P10*Advance_curve!$C$4)/$I$4)","v":166666.625},653.59460784313728,40261.427843137259,925.92592592592587,43.482342070588246,{"$f":"IF($S10<255,Advance_curve!$F$5-V10,\"0\")","v":"0"},"TMR1h>255",null," "]
[null,null,null,null,null,null,null,null,null,null,null,null,null,{"$f":"IF(N10<Advance_curve!$C$103,N10+1,\"End\")","v":4},240,250000,250,{"$f":"IF(N11=\"End\",\" \",INT(P11*Advance_curve!$C$4)/$I$4)","v":125000},490.19607843137254,30196.078431372553,694.44444444444446,43.482352941176472,{"$f":"IF($S11<255,Advance_curve!$F$5-V11,\"0\")","v":"0"},"TMR1h>255",null," "]
[null,null,null,null,null,null,null,null,null,null,null,null,null,{"$f":"IF(N11<Advance_curve!$C$103,N11+1,\"End\")","v":5},300,200000,200,{"$f":"IF(N12=\"End\",\" \",INT(P12*Advance_curve!$C$4)/$I$4)","v":100000},392.15686274509807,24156.862745098042,555.55555555555554,43.48235294117648,{"$f":"IF($S12<255,Advance_curve!$F$5-V12,\"0\")","v":"0"},"TMR1h>255",null," "]
[null,null,null,null,null,null,null,null,null,null,null,null,null,{"$f":"IF(N12<Advance_curve!$C$103,N12+1,\"End\")","v":6},360,166666.66666666666,166.66666666666666,{"$f":"IF(N13=\"End\",\" \",INT(P13*Advance_curve!$C$4)/$I$4)","v":83333.25},326.79705882352943,20130.698823529412,462.96296296296293,43.482309458823529,{"$f":"IF($S13<255,Advance_curve!$F$5-V13,\"0\")","v":"0"},"TMR1h>255",null," "]
[null,null,null,null,null,null,null,null,null,null,null,null,null,{"$f":"IF(N13<Advance_curve!$C$103,N13+1,\"End\")","v":7},420,142857.14285714287,142.85714285714286,{"$f":"IF(N14=\"End\",\" \",INT(P14*Advance_curve!$C$4)/$I$4)","v":71428.5},280.11176470588236,17254.884705882356,396.82539682539687,43.482309458823529,{"$f":"IF($S14<255,Advance_curve!$F$5-V14,\"0\")","v":"0"},"TMR1h>255",null," "]
[null,null,null,null,null,null,null,null,null,null,null,null,null,{"$f":"IF(N14<Advance_curve!$C$103,N14+1,\"End\")","v":8},480,125000,125,{"$f":"IF(N15=\"End\",\" \",INT(P15*Advance_curve!$C$4)/$I$4)","v":62500},245.09803921568627,15098.039215686276,347.22222222222223,43.482352941176472,{"$f":"IF($S15<255,Advance_curve!$F$5-V15,\"0\")","v":6.5176470588235276}," ",null,{"$f":"IF($S15<255,O15,\" \")","v":480}]
[null,null,null,null,null,null,null,null,null,null,null,null,null,{"$f":"IF(N15<Advance_curve!$C$103,N15+1,\"End\")","v":9},540,111111.11111111111,111.11111111111111,{"$f":"IF(N16=\"End\",\" \",INT(P16*Advance_curve!$C$4)/$I$4)","v":55555.5},217.86470588235295,13420.465882352943,308.64197530864197,43.482309458823536,{"$f":"IF($S16<255,Advance_curve!$F$5-V16,\"0\")","v":6.5176905411764636}," ",null,{"$f":"IF($S16<255,O16,\" \")","v":540}]
[null,null,null,null,null,null,null,null,null,null,null,"<= avance",null,{"$f":"IF(N16<Advance_curve!$C$103,N16+1,\"End\")","v":10},600,100000,100,{"$f":"IF(N17=\"End\",\" \",INT(P17*Advance_curve!$C$4)/$I$4)","v":50000},196.07843137254903,12078.431372549021,277.77777777777777,43.48235294117648,{"$f":"IF($S17<255,Advance_curve!$F$5-V17,\"0\")","v":6.5176470588235205}," ",null,600]
[null,null,null,null,null,null,null,null,null,null,null,null,null,{"$f":"IF(N17<Advance_curve!$C$103,N17+1,\"End\")","v":11},660,90909.090909090912,90.909090909090907,{"$f":"IF(N18=\"End\",\" \",INT(P18*Advance_curve!$C$4)/$I$4)","v":45454.5},178.25294117647059,10980.38117647059,252.52525252525254,43.482309458823529,{"$f":"IF($S18<255,Advance_curve!$F$5-V18,\"0\")","v":6.5176905411764707}," ",null,660]
[null,null,null,null,null,null,null,null,null,null,null,null,null,{"$f":"IF(N18<Advance_curve!$C$103,N18+1,\"End\")","v":12},720,83333.333333333328,83.333333333333329,{"$f":"IF(N19=\"End\",\" \",INT(P19*Advance_curve!$C$4)/$I$4)","v":41666.625},163.39852941176471,10065.349411764706,231.48148148148147,43.482309458823529,{"$f":"IF($S19<255,Advance_curve!$F$5-V19,\"0\")","v":6.5176905411764707}," ",null,720]
[null,null,null,null,null,null,null,null,null,null,null,null,null,{"$f":"IF(N19<Advance_curve!$C$103,N19+1,\"End\")","v":13},780,76923.076923076922,76.92307692307692,{"$f":"IF(N20=\"End\",\" \",INT(P20*Advance_curve!$C$4)/$I$4)","v":38461.5},150.8294117647059,9291.0917647058832,213.67521367521368,43.482309458823529,{"$f":"IF($S20<255,Advance_curve!$F$5-V20,\"0\")","v":6.5176905411764707}," ",null,780]
[null,null,null,null,null,null,null,null,null,null,null,"TDC",null,{"$f":"IF(N20<Advance_curve!$C$103,N20+1,\"End\")","v":14},840,71428.571428571435,71.428571428571431,{"$f":"IF(N21=\"End\",\" \",INT(P21*Advance_curve!$C$4)/$I$4)","v":35714.25},140.05588235294118,8627.4423529411779,198.41269841269843,43.482309458823529,{"$f":"IF($S21<255,Advance_curve!$F$5-V21,\"0\")","v":6.5176905411764707}," ",null,840]
[null,null,null,null,null,null,null,null,null,null,null,null,null,{"$f":"IF(N21<Advance_curve!$C$103,N21+1,\"End\")","v":15},900,66666.666666666672,66.666666666666671,{"$f":"IF(N22=\"End\",\" \",INT(P22*Advance_curve!$C$4)/$I$4)","v":33333.25},130.71862745098039,8052.2674509803928,185.18518518518519,43.482244235294118,{"$f":"IF($S22<255,Advance_curve!$F$5-V22,\"0\")","v":6.5177557647058819}," ",null,900]
[null,null,null,null,null,null,null,null,null,null,null,null,null,{"$f":"IF(N22<Advance_curve!$C$103,N22+1,\"End\")","v":16},960,62500,62.5,{"$f":"IF(N23=\"End\",\" \",INT(P23*Advance_curve!$C$4)/$I$4)","v":31250},122.54901960784314,7549.0196078431381,173.61111111111111,43.482352941176472,{"$f":"IF($S23<255,Advance_curve!$F$5-V23,\"0\")","v":6.5176470588235276}," ",null,960]
[null,null,null,null,null,null,null,null,null,null,null,null,null,{"$f":"IF(N23<Advance_curve!$C$103,N23+1,\"End\")","v":17},1020,58823.529411764706,58.823529411764703,{"$f":"IF(N24=\"End\",\" \",INT(P24*Advance_curve!$C$4)/$I$4)","v":29411.75},115.34019607843138,7104.9560784313735,163.3986928104575,43.482331200000012,{"$f":"IF($S24<255,Advance_curve!$F$5-V24,\"0\")","v":6.5176687999999885}," ",null,1020]
[null,null,null,null,null,null,null,null,null,null,null,"<= retard",null,{"$f":"IF(N24<Advance_curve!$C$103,N24+1,\"End\")","v":"End"}," ",{"$error":"#VALUE!"},{"$error":"#VALUE!"},{"$f":"IF(N25=\"End\",\" \",INT(P25*Advance_curve!$C$4)/$I$4)","v":" "}," ",{"$error":"#VALUE!"},{"$error":"#VALUE!"},{"$error":"#VALUE!"},{"$f":"IF($S25<255,Advance_curve!$F$5-V25,\"0\")","v":"0"},"TMR1h>255",null," "]
[null,null,null,null,null,null,null,null,null,null,null,null,null,{"$f":"IF(N25<Advance_curve!$C$103,N25+1,\"End\")","v":"End"},{"$f":"IF(N26=\"End\",\" \",(N26*60*$I$6)/(2*$I$5))","v":" "},{"$error":"#VALUE!"},{"$error":"#VALUE!"},{"$f":"IF(N26=\"End\",\" \",INT(P26*Advance_curve!$C$4)/$I$4)","v":" "}," ",{"$error":"#VALUE!"},{"$error":"#VALUE!"},{"$error":"#VALUE!"},{"$f":"IF($S26<255,Advance_curve!$F$5-V26,\"0\")","v":"0"},"TMR1h>255",null," "]
[null,null,null,null,null,null,null,null,null,null,null,null,null,{"$f":"IF(N26<Advance_curve!$C$103,N26+1,\"End\")","v":"End"},{"$f":"IF(N27=\"End\",\" \",(N27*60*$I$6)/(2*$I$5))","v":" "},{"$f":"IF(N27<>\"End\",(1000000/N27),#N/A)","v":{"$error":"#N/A"}},{"$error":"#N/A"},{"$f":"IF(N27=\"End\",\" \",INT(P27*Advance_curve!$C$4)/$I$4)","v":" "}," ",{"$error":"#VALUE!"},{"$error":"#N/A"},{"$error":"#VALUE!"},{"$f":"IF($S27<255,Advance_curve!$F$5-V27,\"0\")","v":"0"},"TMR1h>255",null," "]
[null,null,null,null,null,null,null,null,null,null,null,null,null,{"$f":"IF(N27<Advance_curve!$C$103,N27+1,\"End\")","v":"End"}," ",{"$f":"IF(N28<>\"End\",(1000000/N28),#N/A)","v":{"$error":"#N/A"}},{"$error":"#N/A"},{"$f":"IF(N28=\"End\",\" \",INT(P28*Advance_curve!$C$4)/$I$4)","v":" "}," ",{"$error":"#VALUE!"},{"$error":"#N/A"},{"$error":"#VALUE!"},{"$f":"IF($S28<255,Advance_curve!$F$5-V28,\"0\")","v":"0"},"TMR1h>255",null," "]
[null,null,null,null,null,null,null,null,null,null,null,null,null,{"$f":"IF(N28<Advance_curve!$C$103,N28+1,\"End\")","v":"End"}," ",{"$error":"#N/A"},{"$error":"#N/A"},{"$f":"IF(N29=\"End\",\" \",INT(P29*Advance_curve!$C$4)/$I$4)","v":" "}," ",{"$error":"#VALUE!"},{"$error":"#N/A"},{"$error":"#VALUE!"},{"$f":"IF($S29<255,Advance_curve!$F$5-V29,\"0\")","v":"0"},"TMR1h>255",null," "]
[null,null,null,null,null,null,null,null,null,null,null,null,null,{"$f":"IF(N29<Advance_curve!$C$103,N29+1,\"End\")","v":"End"}," ",{"$error":"#N/A"},{"$error":"#N/A"},{"$f":"IF(N30=\"End\",\" \",INT(P30*Advance_curve!$C$4)/$I$4)","v":" "}," ",{"$error":"#VALUE!"},{"$error":"#N/A"},{"$error":"#VALUE!"},{"$f":"IF($S30<255,Advance_curve!$F$5-V30,\"0\")","v":"0"},"TMR1h>255",null," "]
[null,null,null,null,null,null,null,null,null,null,null,null,null,{"$f":"IF(N30<Advance_curve!$C$103,N30+1,\"End\")","v":"End"}," ",{"$error":"#N/A"},{"$error":"#N/A"},{"$f":"IF(N31=\"End\",\" \",INT(P31*Advance_curve!$C$4)/$I$4)","v":" "}," ",{"$error":"#VALUE!"},{"$error":"#N/A"},{"$error":"#VALUE!"},{"$f":"IF($S31<255,Advance_curve!$F$5-V31,\"0\")","v":"0"},"TMR1h>255",null," "]
[null,null,null,null,null,null,null,null,null,null,null,null,null,{"$f":"IF(N31<Advance_curve!$C$103,N31+1,\"End\")","v":"End"}," ",{"$error":"#N/A"},{"$error":"#N/A"},{"$f":"IF(N32=\"End\",\" \",INT(P32*Advance_curve!$C$4)/$I$4)","v":" "}," ",{"$error":"#VALUE!"},{"$error":"#N/A"},{"$error":"#VALUE!"},{"$f":"IF($S32<255,Advance_curve!$F$5-V32,\"0\")","v":"0"},"TMR1h>255",null," "]
[null,null,null,null,null,null,null,null,null,null,null,null,null,{"$f":"IF(N32<Advance_curve!$C$103,N32+1,\"End\")","v":"End"}," ",{"$error":"#N/A"},{"$error":"#N/A"},{"$f":"IF(N33=\"End\",\" \",INT(P33*Advance_curve!$C$4)/$I$4)","v":" "}," ",{"$error":"#VALUE!"},{"$error":"#N/A"},{"$error":"#VALUE!"},{"$f":"IF($S33<255,Advance_curve!$F$5-V33,\"0\")","v":"0"},"TMR1h>255",null," "]
[null,null,null,null,null,null,null,null,null,null,null,null,null,{"$f":"IF(N33<Advance_curve!$C$103,N33+1,\"End\")","v":"End"}," ",{"$error":"#N/A"},{"$error":"#N/A"},{"$f":"IF(N34=\"End\",\" \",INT(P34*Advance_curve!$C$4)/$I$4)","v":" "}," ",{"$error":"#VALUE!"},{"$error":"#N/A"},{"$error":"#VALUE!"},{"$f":"IF($S34<255,Advance_curve!$F$5-V34,\"0\")","v":"0"},"TMR1h>255",null," "]
[null,null,null,null,null,null,null,null,null,null,null,null,null,{"$f":"IF(N34<Advance_curve!$C$103,N34+1,\"End\")","v":"End"}," ",{"$error":"#N/A"},{"$error":"#N/A"},{"$f":"IF(N35=\"End\",\" \",INT(P35*Advance_curve!$C$4)/$I$4)","v":" "}," ",{"$error":"#VALUE!"},{"$error":"#N/A"},{"$error":"#VALUE!"},{"$f":"IF($S35<255,Advance_curve!$F$5-V35,\"0\")","v":"0"},"TMR1h>255",null," "]
[null,null,null,null,null,null,null,null,null,null,null,null,null,{"$f":"IF(N35<Advance_curve!$C$103,N35+1,\"End\")","v":"End"}," ",{"$error":"#N/A"},{"$error":"#N/A"},{"$f":"IF(N36=\"End\",\" \",INT(P36*Advance_curve!$C$4)/$I$4)","v":" "}," ",{"$error":"#VALUE!"},{"$error":"#N/A"},{"$error":"#VALUE!"},{"$f":"IF($S36<255,Advance_curve!$F$5-V36,\"0\")","v":"0"},"TMR1h>255",null," "]
[null,null,null,null,null,null,null,null,null,null,null,null,null,{"$f":"IF(N36<Advance_curve!$C$103,N36+1,\"End\")","v":"End"}," ",{"$error":"#N/A"},{"$error":"#N/A"},{"$f":"IF(N37=\"End\",\" \",INT(P37*Advance_curve!$C$4)/$I$4)","v":" "}," ",{"$error":"#VALUE!"},{"$error":"#N/A"},{"$error":"#VALUE!"},{"$f":"IF($S37<255,Advance_curve!$F$5-V37,\"0\")","v":"0"},"TMR1h>255",null," "]
[null,null,null,null,null,null,null,null,null,null,null,null,null,{"$f":"IF(N37<Advance_curve!$C$103,N37+1,\"End\")","v":"End"}," ",{"$error":"#N/A"},{"$error":"#N/A"},{"$f":"IF(N38=\"End\",\" \",INT(P38*Advance_curve!$C$4)/$I$4)","v":" "}," ",{"$error":"#VALUE!"},{"$error":"#N/A"},{"$error":"#VALUE!"},{"$f":"IF($S38<255,Advance_curve!$F$5-V38,\"0\")","v":"0"},"TMR1h>255",null," "]
[null,null,null,null,null,null,null,null,null,null,null,null,null,{"$f":"IF(N38<Advance_curve!$C$103,N38+1,\"End\")","v":"End"}," ",{"$error":"#N/A"},{"$error":"#N/A"},{"$f":"IF(N39=\"End\",\" \",INT(P39*Advance_curve!$C$4)/$I$4)","v":" "}," ",{"$error":"#VALUE!"},{"$error":"#N/A"},{"$error":"#VALUE!"},{"$f":"IF($S39<255,Advance_curve!$F$5-V39,\"0\")","v":"0"},"TMR1h>255",null," "]
[null,null,null,null,null,null,null,null,null,null,null,null,null,{"$f":"IF(N39<Advance_curve!$C$103,N39+1,\"End\")","v":"End"}," ",{"$error":"#N/A"},{"$error":"#N/A"},{"$f":"IF(N40=\"End\",\" \",INT(P40*Advance_curve!$C$4)/$I$4)","v":" "}," ",{"$error":"#VALUE!"},{"$error":"#N/A"},{"$error":"#VALUE!"},{"$f":"IF($S40<255,Advance_curve!$F$5-V40,\"0\")","v":"0"},"TMR1h>255",null," "]
[null,null,null,null,null,null,null,null,null,null,null,null,null,{"$f":"IF(N40<Advance_curve!$C$103,N40+1,\"End\")","v":"End"}," ",{"$error":"#N/A"},{"$error":"#N/A"},{"$f":"IF(N41=\"End\",\" \",INT(P41*Advance_curve!$C$4)/$I$4)","v":" "}," ",{"$error":"#VALUE!"},{"$error":"#N/A"},{"$error":"#VALUE!"},{"$f":"IF($S41<255,Advance_curve!$F$5-V41,\"0\")","v":"0"},"TMR1h>255",null," "]
[null,null,null,null,null,null,null,null,null,null,null,null,null,{"$f":"IF(N41<Advance_curve!$C$103,N41+1,\"End\")","v":"End"}," ",{"$error":"#N/A"},{"$error":"#N/A"},{"$f":"IF(N42=\"End\",\" \",INT(P42*Advance_curve!$C$4)/$I$4)","v":" "}," ",{"$error":"#VALUE!"},{"$error":"#N/A"},{"$error":"#VALUE!"},{"$f":"IF($S42<255,Advance_curve!$F$5-V42,\"0\")","v":"0"},"TMR1h>255",null," "]
[null,null,null,null,null,null,null,null,null,null,null,null,null,{"$f":"IF(N42<Advance_curve!$C$103,N42+1,\"End\")","v":"End"}," ",{"$error":"#N/A"},{"$error":"#N/A"},{"$f":"IF(N43=\"End\",\" \",INT(P43*Advance_curve!$C$4)/$I$4)","v":" "}," ",{"$error":"#VALUE!"},{"$error":"#N/A"},{"$error":"#VALUE!"},{"$f":"IF($S43<255,Advance_curve!$F$5-V43,\"0\")","v":"0"},"TMR1h>255",null," "]
[null,null,null,null,null,null,null,null,null,null,null,null,null,{"$f":"IF(N43<Advance_curve!$C$103,N43+1,\"End\")","v":"End"}," ",{"$error":"#N/A"},{"$error":"#N/A"},{"$f":"IF(N44=\"End\",\" \",INT(P44*Advance_curve!$C$4)/$I$4)","v":" "}," ",{"$error":"#VALUE!"},{"$error":"#N/A"},{"$error":"#VALUE!"},{"$f":"IF($S44<255,Advance_curve!$F$5-V44,\"0\")","v":"0"},"TMR1h>255",null," "]
[null,null,null,null,null,null,null,null,null,null,null,null,null,{"$f":"IF(N44<Advance_curve!$C$103,N44+1,\"End\")","v":"End"}," ",{"$error":"#N/A"},{"$error":"#N/A"},{"$f":"IF(N45=\"End\",\" \",INT(P45*Advance_curve!$C$4)/$I$4)","v":" "}," ",{"$error":"#VALUE!"},{"$error":"#N/A"},{"$error":"#VALUE!"},{"$f":"IF($S45<255,Advance_curve!$F$5-V45,\"0\")","v":"0"},"TMR1h>255",null," "]
[null,null,null,null,null,null,null,null,null,null,null,null,null,{"$f":"IF(N45<Advance_curve!$C$103,N45+1,\"End\")","v":"End"}," ",{"$error":"#N/A"},{"$error":"#N/A"},{"$f":"IF(N46=\"End\",\" \",INT(P46*Advance_curve!$C$4)/$I$4)","v":" "}," ",{"$error":"#VALUE!"},{"$error":"#N/A"},{"$error":"#VALUE!"},{"$f":"IF($S46<255,Advance_curve!$F$5-V46,\"0\")","v":"0"},"TMR1h>255",null," "]
[null,null,null,null,null,null,null,null,null,null,null,null,null,{"$f":"IF(N46<Advance_curve!$C$103,N46+1,\"End\")","v":"End"}," ",{"$error":"#N/A"},{"$error":"#N/A"},{"$f":"IF(N47=\"End\",\" \",INT(P47*Advance_curve!$C$4)/$I$4)","v":" "}," ",{"$error":"#VALUE!"},{"$error":"#N/A"},{"$error":"#VALUE!"},{"$f":"IF($S47<255,Advance_curve!$F$5-V47,\"0\")","v":"0"},"TMR1h>255",null," "]
[null,null,null,null,null,null,null,null,null,null,null,null,null,{"$f":"IF(N47<Advance_curve!$C$103,N47+1,\"End\")","v":"End"}," ",{"$error":"#N/A"},{"$error":"#N/A"},{"$f":"IF(N48=\"End\",\" \",INT(P48*Advance_curve!$C$4)/$I$4)","v":" "}," ",{"$error":"#VALUE!"},{"$error":"#N/A"},{"$error":"#VALUE!"},{"$f":"IF($S48<255,Advance_curve!$F$5-V48,\"0\")","v":"0"},"TMR1h>255",null," "]
[null,null,null,null,null,null,null,null,null,null,null,null,null,{"$f":"IF(N48<Advance_curve!$C$103,N48+1,\"End\")","v":"End"}," ",{"$error":"#N/A"},{"$error":"#N/A"},{"$f":"IF(N49=\"End\",\" \",INT(P49*Advance_curve!$C$4)/$I$4)","v":" "}," ",{"$error":"#VALUE!"},{"$error":"#N/A"},{"$error":"#VALUE!"},{"$f":"IF($S49<255,Advance_curve!$F$5-V49,\"0\")","v":"0"},"TMR1h>255",null," "]

{"sheet":"VeryLowRPM","index":3,"n_rows":11,"n_cols":7,"rows_kept":11,"cut":false,"hidden":false,"merged":[]}
[]
[null,{"$f":"CONCATENATE(\"advance from \",E9,\" to \",advance_at_lowRPM!Z7,\" RPM\")","v":"advance from 91 to 480 RPM"}]
[null,null,null,null,null,null,"Si une periode entre 2 pkp fait 131ms pour 360°"]
[null,"Prescaler",{"$f":"Advance_curve!O30","v":8},null,null,null,"alors 50° (pkp position) sont parcourus en 131/360*50 = 18ms"]
[null,"clock",{"$f":"Advance_curve!C3","v":16},null,null,null,"Si on attend 18ms x TMR1DEB on spark pile au TDC."]
[null,"periode TMR1L",{"$f":"4*C4/C5","v":2},null,5,"debords max"]
[null,"TMR1",{"$f":"65536*C6/1000","v":131.072},"ms",{"$f":"E6*C7","v":655.36},"ms max"]
[null,"pkp position",{"$f":"Advance_curve!F5","v":50},"deg",{"$f":"1000/E7","v":1.52587890625},"Hz min","If one period between 2 pickups last 131ms for 360°"]
[null,"Time from pickup position to TDC",{"$f":"(C7/360)*C8+C11","v":18.204444444444444},"ms",{"$f":"INT(60*E8)","v":91},"rpm min","then 50° (which is the pickup position) are travelled in 131/360 * 50 = 18ms"]
[null,null,null,null,null,null,"If the processor waits 18ms * TMR1DEB (Number of Timer1 overflows) than spark append just at TDC"]
[null,"Manual shift",0,"ms"]

{"sheet":"EEPROM16","index":4,"n_rows":66,"n_cols":24,"rows_kept":66,"cut":false,"hidden":false,"merged":[]}
[null,null,null,null,null,null,null,null,null,null,null,null,null,null,"INTEL 16HEX format",null,"RAW format"]
[null,null,null,null,null,null,null,null,null,null,null,null,null,null,":020000040000FA"]
["Bytes\n in\nRow","Address\nMSB (hex)","Address\nLSB (hex)","Address Start (MSB)","Address\nStart\n(LSB)","+0","+1","+2","+3","+4","+5","+6","+7",null,":020000040001F9",null,null,null,"sum[dec]","sum[hex]","LSB","two's\ncomplement [dec]","two's\ncomplement +1","cksum"]
[16,{"$f":"DEC2HEX(D4,2)","v":"E0"},{"$f":"DEC2HEX(E4,2)","v":"00"},224,0,{"$f":"Advance_curve!L9","v":0},{"$f":"Advance_curve!L10","v":0},{"$f":"Advance_curve!L11","v":0},{"$f":"Advance_curve!L12","v":1.2},{"$f":"Advance_curve!L13","v":3.55},{"$f":"Advance_curve!L14","v":5.8},{"$f":"Advance_curve!L15","v":8},{"$f":"Advance_curve!L16","v":10.15},null,{"$f":"\":\"&DEC2HEX(A4,2)&B4&C4&\"00\"&DEC2HEX(F4,2)&\"00\"&DEC2HEX(G4,2)&\"00\"&DEC2HEX(H4,2)&\"00\"&DEC2HEX(I4,2)&\"00\"&DEC2HEX(J4,2)&\"00\"&DEC2HEX(K4,2)&\"00\"&DEC2HEX(L4,2)&\"00\"&DEC2HEX(M4,2)&\"00\"&X4","v":":10E0000000000000000001000300050008000A00F4"},null,{"$f":"DEC2HEX(F4,2)&\" \"&DEC2HEX(G4,2)&\" \"&DEC2HEX(H4,2)&\" \"&DEC2HEX(I4,2)&\"   \"&DEC2HEX(J4,2)&\" \"&DEC2HEX(K4,2)&\" \"&DEC2HEX(L4,2)&\" \"&DEC2HEX(M4,2)","v":"00 00 00 01   03 05 08 0A"},null,{"$f":"SUM(A4,D4:M4)","v":268.7},{"$f":"DEC2HEX(S4)","v":"10C"},{"$f":"RIGHT(T4,2)","v":"0C"},{"$f":"255-HEX2DEC(U4)","v":243},{"$f":"V4+1","v":244},{"$f":"IF(W4=256,\"00\",DEC2HEX(W4,2))","v":"F4"}]
[16,{"$f":"DEC2HEX(D5,2)","v":"E0"},{"$f":"DEC2HEX(E5,2)","v":"10"},224,16,{"$f":"Advance_curve!L17","v":12.275},{"$f":"Advance_curve!L18","v":14.35},{"$f":"Advance_curve!L19","v":16.399999999999999},{"$f":"Advance_curve!L20","v":18.399999999999999},{"$f":"Advance_curve!L21","v":20.399999999999999},{"$f":"Advance_curve!L22","v":22.35},{"$f":"Advance_curve!L23","v":24.3},{"$f":"Advance_curve!L24","v":26.25},null,{"$f":"\":\"&DEC2HEX(A5,2)&B5&C5&\"00\"&DEC2HEX(F5,2)&\"00\"&DEC2HEX(G5,2)&\"00\"&DEC2HEX(H5,2)&\"00\"&DEC2HEX(I5,2)&\"00\"&DEC2HEX(J5,2)&\"00\"&DEC2HEX(K5,2)&\"00\"&DEC2HEX(L5,2)&\"00\"&DEC2HEX(M5,2)&\"00\"&X5","v":":10E010000C000E00100012001400160018001A0066"},null,"0C 0E 10 12   14 16 18 1A",null,{"$f":"SUM(A5,D5:M5)","v":410.72499999999997},{"$f":"DEC2HEX(S5)","v":"19A"},{"$f":"RIGHT(T5,2)","v":"9A"},{"$f":"255-HEX2DEC(U5)","v":101},102,"66"]
[16,"E0","20",224,32,{"$f":"Advance_curve!L25","v":28.175000000000001},{"$f":"Advance_curve!L26","v":30.074999999999999},{"$f":"Advance_curve!L27","v":31.95},{"$f":"Advance_curve!L28","v":33.825000000000003},{"$f":"Advance_curve!L29","v":35.700000000000003},{"$f":"Advance_curve!L30","v":37.549999999999997},{"$f":"Advance_curve!L31","v":39.375},{"$f":"Advance_curve!L32","v":41.225000000000001},null,":10E020001C001E001F0021002300250027002900DB",null,"1C 1E 1F 21   23 25 27 29",null,{"$f":"SUM(A6,D6:M6)","v":549.875},"225","25",218,219,"DB"]
[16,"E0","30",224,48,{"$f":"Advance_curve!L33","v":43.075000000000003},{"$f":"Advance_curve!L34","v":44.9},{"$f":"Advance_curve!L35","v":46.7},{"$f":"Advance_curve!L36","v":48.524999999999999},{"$f":"Advance_curve!L37","v":50.325000000000003},{"$f":"Advance_curve!L38","v":52.125},{"$f":"Advance_curve!L39","v":53.9},{"$f":"Advance_curve!L40","v":55.7},null,":10E030002B002C002E003000320034003500370055",null,"2B 2C 2E 30   32 34 35 37",null,{"$f":"SUM(A7,D7:M7)","v":683.25},"2AB","AB",84,85,"55"]
[16,"E0","40",224,64,{"$f":"Advance_curve!L41","v":57.5},{"$f":"Advance_curve!L42","v":59.274999999999999},{"$f":"Advance_curve!L43","v":61.075000000000003},{"$f":"Advance_curve!L44","v":62.825000000000003},{"$f":"Advance_curve!L45","v":64.599999999999994},{"$f":"Advance_curve!L46","v":66.349999999999994},{"$f":"Advance_curve!L47","v":68.125},{"$f":"Advance_curve!L48","v":69.875},null,":10E0400039003B003D003E004000420044004500D3",null,"39 3B 3D 3E   40 42 44 45",null,813.625,"32D","2D",210,211,"D3"]
[16,"E0","50",224,80,{"$f":"Advance_curve!L49","v":71.625},{"$f":"Advance_curve!L50","v":73.400000000000006},{"$f":"Advance_curve!L51","v":75.2},{"$f":"Advance_curve!L52","v":76.924999999999997},{"$f":"Advance_curve!L53","v":78.650000000000006},{"$f":"Advance_curve!L54","v":80.424999999999997},{"$f":"Advance_curve!L55","v":82.15},{"$f":"Advance_curve!L56","v":83.9},null,":10E05000470049004B004C004E0050005200530052",null,"47 49 4B 4C   4E 50 52 53",null,942.27499999999986,"3AE","AE",81,82,"52"]
[16,"E0","60",224,96,{"$f":"Advance_curve!L57","v":85.65},{"$f":"Advance_curve!L58","v":87.4},{"$f":"Advance_curve!L59","v":89.125},{"$f":"Advance_curve!L60","v":90.9},{"$f":"Advance_curve!L61","v":92.625},{"$f":"Advance_curve!L62","v":94.375},{"$f":"Advance_curve!L63","v":96.125},{"$f":"Advance_curve!L64","v":97.825000000000003},null,":10E060005500570059005A005C005E0060006100D2",null,"55 57 59 5A   5C 5E 60 61",null,1070.0249999999999,"42E","2E",209,210,"D2"]
[16,"E0","70",224,112,{"$f":"Advance_curve!L65","v":99.55},{"$f":"Advance_curve!L66","v":101.325},{"$f":"Advance_curve!L67","v":103.05},{"$f":"Advance_curve!L68","v":104.72499999999999},{"$f":"Advance_curve!L69","v":106.52500000000001},{"$f":"Advance_curve!L70","v":108.175},{"$f":"Advance_curve!L71","v":109.95},{"$f":"Advance_curve!L72","v":111.675},null,":10E0700063006500670068006A006C006D006F0054",null,"63 65 67 68   6A 6C 6D 6F",null,1196.9749999999999,"4AC","AC",83,84,"54"]
[16,"E0","80",224,128,{"$f":"Advance_curve!L73","v":113.425},{"$f":"Advance_curve!L74","v":115.125},{"$f":"Advance_curve!L75","v":116.875},{"$f":"Advance_curve!L76","v":118.52500000000001},{"$f":"Advance_curve!L77","v":120.3},{"$f":"Advance_curve!L78","v":122.05},{"$f":"Advance_curve!L79","v":123.675},{"$f":"Advance_curve!L80","v":125.47499999999999},null,":10E08000710073007400760078007A007B007D00D5",null,"71 73 74 76   78 7A 7B 7D",null,1323.4499999999998,"52B","2B",212,213,"D5"]
[16,"E0","90",224,144,{"$f":"Advance_curve!L81","v":127.175},{"$f":"Advance_curve!L82","v":128.92500000000001},{"$f":"Advance_curve!L83","v":130.55000000000001},{"$f":"Advance_curve!L84","v":132.35},{"$f":"Advance_curve!L85","v":134.05000000000001},{"$f":"Advance_curve!L86","v":135.80000000000001},{"$f":"Advance_curve!L87","v":137.44999999999999},{"$f":"Advance_curve!L88","v":139.22499999999999},null,":10E090007F008000820084008600870089008B0057",null,"7F 80 82 84   86 87 89 8B",null,1449.5250000000001,"5A9","A9",86,87,{"$f":"IF(W13=256,\"00\",DEC2HEX(W13,2))","v":"57"}]
[16,"E0","A0",224,160,{"$f":"Advance_curve!L89","v":140.92500000000001},{"$f":"Advance_curve!L90","v":142.65},{"$f":"Advance_curve!L91","v":144.27500000000001},{"$f":"Advance_curve!L92","v":146.05000000000001},{"$f":"Advance_curve!L93","v":147.72499999999999},{"$f":"Advance_curve!L94","v":149.4},{"$f":"Advance_curve!L95","v":151.125},{"$f":"Advance_curve!L96","v":152.875},null,":10E0A0008C008E00900092009300950097009800D9",null,"8C 8E 90 92   93 95 97 98",null,1575.0249999999999,"627","27",216,217,{"$f":"IF(W14=256,\"00\",DEC2HEX(W14,2))","v":"D9"}]
[16,"E0","B0",224,176,{"$f":"Advance_curve!L97","v":154.65},{"$f":"Advance_curve!L98","v":156.30000000000001},{"$f":"Advance_curve!L99","v":157.97499999999999},{"$f":"Advance_curve!L100","v":159.80000000000001},{"$f":"Advance_curve!L101","v":161.375},{"$f":"Advance_curve!L102","v":163.125},{"$f":"Advance_curve!L103","v":164.875},0,null,":10E0B0009A009C009D009F00A100A300A400000002",null,"9A 9C 9D 9F   A1 A3 A4 00",null,1534.1000000000001,"5FE","FE",1,2,"02"]
[16,"E0","C0",224,192,0,0,0,0,0,0,0,0,null,":10E0C0000000000000000000000000000000000050",null,"00 00 00 00   00 00 00 00",null,432,{"$f":"DEC2HEX(S16)","v":"1B0"},{"$f":"RIGHT(T16,2)","v":"B0"},{"$f":"255-HEX2DEC(U16)","v":79},{"$f":"V16+1","v":80},{"$f":"IF(W16=256,\"00\",DEC2HEX(W16,2))","v":"50"}]
[16,"E0","D0",224,208,0,0,0,0,0,0,0,{"$f":"Advance_curve!$I$1","v":1},null,{"$f":"\":\"&DEC2HEX(A17,2)&B17&C17&\"00\"&DEC2HEX(F17,2)&\"00\"&DEC2HEX(G17,2)&\"00\"&DEC2HEX(H17,2)&\"00\"&DEC2HEX(I17,2)&\"00\"&DEC2HEX(J17,2)&\"00\"&DEC2HEX(K17,2)&\"00\"&DEC2HEX(L17,2)&\"00\"&DEC2HEX(M17,2)&\"00\"&X17","v":":10E0D000000000000000000000000000000001003F"},null,{"$f":"DEC2HEX(F17,2)&\" \"&DEC2HEX(G17,2)&\" \"&DEC2HEX(H17,2)&\" \"&DEC2HEX(I17,2)&\"   \"&DEC2HEX(J17,2)&\" \"&DEC2HEX(K17,2)&\" \"&DEC2HEX(L17,2)&\" \"&DEC2HEX(M17,2)","v":"00 00 00 00   00 00 00 01"},null,449,"1C1","C1",62,63,"3F"]
[16,"E0","E0",224,224,{"$f":"Advance_curve!$J$1","v":79},{"$f":"Advance_curve!$K$1","v":7},{"$f":"Advance_curve!$L$1","v":11},{"$f":"Advance_curve!$F$5","v":50},50,{"$f":"Advance_curve!$O$25","v":2},{"$f":"Advance_curve!P38","v":1},20,null,{"$f":"\":\"&DEC2HEX(A18,2)&B18&C18&\"00\"&DEC2HEX(F18,2)&\"00\"&DEC2HEX(G18,2)&\"00\"&DEC2HEX(H18,2)&\"00\"&DEC2HEX(I18,2)&\"00\"&DEC2HEX(J18,2)&\"00\"&DEC2HEX(K18,2)&\"00\"&DEC2HEX(L18,2)&\"00\"&DEC2HEX(M18,2)&\"00\"&X18","v":":10E0E0004F0007000B003200320002000100140054"},null,{"$f":"DEC2HEX(F18,2)&\" \"&DEC2HEX(G18,2)&\" \"&DEC2HEX(H18,2)&\" \"&DEC2HEX(I18,2)&\"   \"&DEC2HEX(J18,2)&\" \"&DEC2HEX(K18,2)&\" \"&DEC2HEX(L18,2)&\" \"&DEC2HEX(M18,2)","v":"4F 07 0B 32   32 02 01 14"},null,684,"2AC","AC",83,84,"54"]
[16,"E0","F0",224,240,{"$f":"VeryLowRPM!C9","v":18.204444444444444},0,{"$f":"IF(Advance_curve!$O$32=\"Auto\",99,Advance_curve!$O$32/ 500)","v":1},{"$f":"Advance_curve!$O$30","v":8},{"$f":"advance_at_lowRPM!$I$2","v":14},{"$f":"Advance_curve!$L$5","v":40},{"$f":"Advance_curve!$B$9","v":23},{"$f":"Advance_curve!$B$103","v":117},null,":10E0F00012000000010008000E0028001700750043",null,{"$f":"DEC2HEX(F19,2)&\" \"&DEC2HEX(G19,2)&\" \"&DEC2HEX(H19,2)&\" \"&DEC2HEX(I19,2)&\"   \"&DEC2HEX(J19,2)&\" \"&DEC2HEX(K19,2)&\" \"&DEC2HEX(L19,2)&\" \"&DEC2HEX(M19,2)","v":"12 00 01 08   0E 28 17 75"},null,701.20444444444445,"2BD","BD",66,67,"43"]
[16,"E1","00",225,0,255,255,255,255,255,255,255,255,null,":10E10000FF00FF00FF00FF00FF00FF00FF00FF0017",null,"FF FF FF FF   FF FF FF FF",null,2281,{"$f":"DEC2HEX(S20)","v":"8E9"},{"$f":"RIGHT(T20,2)","v":"E9"},{"$f":"255-HEX2DEC(U20)","v":22},{"$f":"V20+1","v":23},{"$f":"IF(W20=256,\"00\",DEC2HEX(W20,2))","v":"17"}]
[16,"E1","10",225,16,255,255,255,255,255,255,255,255,null,":10E11000FF00FF00FF00FF00FF00FF00FF00FF0007",null,"FF FF FF FF   FF FF FF FF",null,2297,"8F9","F9",6,7,"07"]
[16,"E1","20",225,32,255,255,255,255,255,255,255,255,null,":10E12000FF00FF00FF00FF00FF00FF00FF00FF00F7",null,"FF FF FF FF   FF FF FF FF",null,2313,"909","09",246,247,"F7"]
[16,"E1","30",225,48,255,255,255,255,255,255,255,255,null,":10E13000FF00FF00FF00FF00FF00FF00FF00FF00E7",null,"FF FF FF FF   FF FF FF FF",null,2329,"919","19",230,231,"E7"]
[16,"E1","40",225,64,255,255,255,255,255,255,255,255,null,":10E14000FF00FF00FF00FF00FF00FF00FF00FF00D7",null,"FF FF FF FF   FF FF FF FF",null,2345,"929","29",214,215,"D7"]
[16,"E1","50",225,80,255,255,255,255,255,255,255,255,null,":10E15000FF00FF00FF00FF00FF00FF00FF00FF00C7",null,"FF FF FF FF   FF FF FF FF",null,2361,"939","39",198,199,"C7"]
[16,"E1","60",225,96,255,255,255,255,255,255,255,255,null,":10E16000FF00FF00FF00FF00FF00FF00FF00FF00B7",null,"FF FF FF FF   FF FF FF FF",null,2377,"949","49",182,183,"B7"]
[16,"E1","70",225,112,255,255,255,255,255,255,255,255,null,":10E17000FF00FF00FF00FF00FF00FF00FF00FF00A7",null,"FF FF FF FF   FF FF FF FF",null,2393,"959","59",166,167,"A7"]
[16,"E1","80",225,128,255,255,255,255,255,255,255,255,null,":10E18000FF00FF00FF00FF00FF00FF00FF00FF0097",null,"FF FF FF FF   FF FF FF FF",null,2409,"969","69",150,151,"97"]
[16,"E1","90",225,144,255,255,255,255,255,255,255,255,null,":10E19000FF00FF00FF00FF00FF00FF00FF00FF0087",null,"FF FF FF FF   FF FF FF FF",null,2425,"979","79",134,135,"87"]
[16,"E1","A0",225,160,255,255,255,255,255,255,255,255,null,":10E1A000FF00FF00FF00FF00FF00FF00FF00FF0077",null,"FF FF FF FF   FF FF FF FF",null,2441,"989","89",118,119,"77"]
[16,"E1","B0",225,176,255,255,255,255,255,255,255,255,null,":10E1B000FF00FF00FF00FF00FF00FF00FF00FF0067",null,"FF FF FF FF   FF FF FF FF",null,2457,"999","99",102,103,"67"]
[16,"E1","C0",225,192,255,255,255,255,255,255,255,255,null,":10E1C000FF00FF00FF00FF00FF00FF00FF00FF0057",null,"FF FF FF FF   FF FF FF FF",null,2473,"9A9","A9",86,87,"57"]
[16,"E1","D0",225,208,255,255,255,255,255,255,255,255,null,":10E1D000FF00FF00FF00FF00FF00FF00FF00FF0047",null,"FF FF FF FF   FF FF FF FF",null,2489,"9B9","B9",70,71,"47"]
[16,"E1","E0",225,224,255,255,255,255,255,255,255,255,null,":10E1E000FF00FF00FF00FF00FF00FF00FF00FF0037",null,"FF FF FF FF   FF FF FF FF",null,2505,"9C9","C9",54,55,"37"]
[16,"E1","F0",225,240,255,255,255,255,255,255,255,255,null,":10E1F000FF00FF00FF00FF00FF00FF00FF00FF0027",null,"FF FF FF FF   FF FF FF FF",null,2521,"9D9","D9",38,39,"27"]
[null,null,null,null,null,"End of File",null,null,null,null,null,null,null,null,":00000001FF"]
[]
[]
[]
[null,null,null,null,null,null,null,null,null,null,null,null,null,null,"The checksum value is the two's complement of the least significant byte (LSB) of the sum of all decoded byte values in the record that precede the checksum. "]
[null,null,null,null,null,null,null,null,null,null,null,null,null,null,"It is computed by summing the decoded byte values, extracting the LSB of the sum, and calculating the two's complement of the LSB"]
[null,null,null,null,null,null,null,null,null,null,null,null,null,null,"(e.g., by inverting its bits and adding one)."]
[null,null,null,null,null,null,null,null,null,null,null,null,null,null,"For example, in the case of the record :0300300002337A1E, the sum of the decoded byte values is 03 + 00 + 30 + 00 + 02 + 33 + 7A = E2."]
[null,null,null,null,null,null,null,null,null,null,null,null,null,null,"The two's complement of E2 is 1E, which is the checksum appearing at the end of the record."]
[]
[null,null,null,null,null,null,null,null,null,null,null,null,null,null,"Pour effectuer un complément à 2 il faut :"]
[null,null,null,null,null,null,null,null,null,null,null,null,null,null,"- Inverser tout les bits (1 en 0, 0 en 1) (ou faire 255-chiffre) Ex: DECHEX(255-SOMME(B3:K3)+1) = DECHEX(255+1-SOMME(B3:K3)) = DECHEX(256-SOMME(B3:K3))"]
[null,null,null,null,null,null,null,null,null,null,null,null,null,null," puis ajouter 1 au résultat"]
[null,null,null,null,null,null,null,null,null,null,null,null,null,null,"le complement a 2 de 0 est egal a 0"]
[null,null,null,null,null,null,null,null,null,null,null,null,null,null,"Si 2 derniers chiffres de h100 = 00: cksum OK"]
[]
[]
[null,null,null,null,null,null,null,null,null,null,null,null,null,null,"Méthode 1 (1er onglet)"]
[null,null,null,null,null,null,null,null,null,null,null,null,null,null,"C'est la méthode bestiale. On convertit le nombre (positif) en base 2, puis on inverse les bits et ensuite on ajoute 1 avec propagation d'une éventuelle retenue."]
[]
[null,null,null,null,null,null,null,null,null,null,null,null,null,null,"Méthode 2 (2ème onglet)"]
[null,null,null,null,null,null,null,null,null,null,null,null,null,null,"On utilise la formule suivante pour le complément à 2: Si X est le nombre négatif à convertir, la conversion de (2^16)-|X| en base 2 donne le résultat."]
[null,":10E000001B"]
[null,":BBAAAATTHHHHHH.....HHHHCC"]
[null,"BB est le nombre d'octets de données dans la ligne (en hexadécimal)"]
[null,"AAAA est l'adresse absolue (ou relative) du début de la lign"]
[null,"TT est le champ spécifiant le type"]
[null,"HH...HHHH est le champ des données",null,null,null,null,null,null,null,"00, données, contient les données et l'adresse 16 bit."]
[null,"CC est l'octet de checksum. C'est le complément à deux de la somme des valeurs binaires des octets de tous les autres champs. (Les calculs sont faits sur 8 bits, en ignorant les retenues.)"]
[]
[null,"Pour vérifier la validité des données, il suffit de faire la somme de tous les octets représentés, à partir des deux-points jusqu'à la fin de ligne (checksum inclus: BB+AA+AA+TT+HH+...+CC): le résultat attendu est 0 (modulo 256)."]

{"sheet":"Accuracy","index":5,"n_rows":16,"n_cols":3,"rows_kept":16,"cut":false,"hidden":false,"merged":[]}
["CYLINDRE:",1,"cyl"]
["STROKES",2,"stk"]
["ACCURACY",3.4,"us"]
[]
["RPM","ERROR"]
[0,0]
[1000,{"$f":"$B$3/((1000*(60*$B$2)/(2*$B$1*$A7))/0.36)","v":2.0399999999999998E-2}]
[2000,{"$f":"$B$3/((1000*(60*$B$2)/(2*$B$1*$A8))/0.36)","v":4.0799999999999996E-2}]
[3000,6.1199999999999997E-2]
[4000,8.1599999999999992E-2]
[5000,0.10199999999999999]
[6000,0.12239999999999999]
[7000,0.14279999999999998]
[8000,0.16319999999999998]
[9000,0.18359999999999999]
[10000,0.20399999999999999]

{"sheet":"formules","index":6,"n_rows":48,"n_cols":18,"rows_kept":48,"cut":false,"hidden":false,"merged":[[13,8,13,9],[13,12,13,13],[13,14,13,15],[14,14,14,15],[0,8,0,9],[45,2,45,5],[45,6,45,9],[46,6,46,9],[46,2,46,5],[47,2,47,9]]}
[null,null,"TEMPS","CYLINDRE","RPM","FREQUENCE","PERIODE","PERIODE","1°",null,"durée =","degrés","relatif\npickup"]
[null,null,"Nbr","Nbr","tr/mn","Hz","ms","pour 2cyl 2tps","ms","us","us",null,{"$f":"Advance_curve!F5","v":50}]
[null,null,2,1,4000,{"$f":"(2*$D$3*$E$3)/(60*$C$3)","v":66.666666666666671},{"$f":"1000*(60*$C$3)/(2*$D$3*$E$3)","v":15},{"$f":"1000*60/$E$3","v":15},{"$f":"G3/360","v":4.1666666666666664E-2},{"$f":"G3/0.36","v":41.666666666666671},1884,{"$f":"K3/J3","v":45.215999999999994},{"$f":"L3-Advance_curve!F5","v":-4.784000000000006}]
[]
[null,null,null,null,{"$f":"(60*$F$5*$C$3)/(2*$D$3)","v":7200},120,{"$f":"1000*(60*$C$3)/(2*$D$3*$E$5)","v":8.3333333333333339},{"$f":"1000*60/$E$5","v":8.3333333333333339},{"$f":"G5/360","v":2.314814814814815E-2},{"$f":"G5/0.36","v":23.148148148148152},null,"FRQ = (2*CYL*RPM) / (60*TEMPS)"]
[null,null,null,null,null,null,null,null,null,null,null,"RPM = (60*FRQ*TEMPS) / ( 2*CYL)"]
[null,null,null,null,"Délai","=>","Délai","Avance",null,null,null,"1degré = (1000*1000*60*CYL) / ( 2*TEMPS*RPM)/360"]
[null,null,null,null,"us",null,"°","°",null,null,null,"RPM= 60*1000000/ TMR1*256*presc/Fosc"]
[null,null,null,null,1200,null,{"$f":"E9/J3","v":28.799999999999997},{"$f":"Advance_curve!F5 -G9","v":21.200000000000003},null,null,null,"TMR1=(PER*Fosc)/ presc*255"]
[null,null,null,null,null,null,null,null,null,null,null,"FRQ = 1/TMR1H = 1/TMR1H * (255 * PRES/Fosc) = 1*1000000 / TMR1H* (255 * PRES/Fosc) "]
[null,null,null,null,"FRQ","PERIODE","RPM"]
[null,null,null,null,6000,{"$f":"1000/E12","v":0.16666666666666666},{"$f":"E12*60","v":360000}]
[]
[null,"Multiplier","Delay","Prescaler","Nombre de","Nombre","Fréquence","Régime","Période",null,"TIMER1","TMR1DEB","Delay of:",null,{"$f":"IF(P17>0,\"Avance\",\"RETARD\")","v":"RETARD"},null,null,"a 4Mhz,Timer1 = periode(us) *255"]
[null,null,null,null,"Cylindres","de temps",null,null,null,null,"high","nbr",null,null,"BTDC",null,null,"a 16Mhz,Timer1 = periode(us) *64  (256/4)"]
[null,null,"us",null,null,null,"Hz","tr/mn","ms","µs",{"$f":"IF(K17>256,\"erreur\",\"\")","v":"erreur"},null,"µs","ms","ms","degrees"]
[null,4,20,{"$f":"Advance_curve!O30","v":8},1,2,5.6,{"$f":"(G17*60*F17)/(2*E17)","v":336},{"$f":"1000/G17","v":178.57142857142858},{"$f":"1000000/G17","v":178571.42857142858},{"$f":"INT(J17/($D$17*64))","v":348},{"$f":"INT(K17/255)","v":1},{"$f":" ($C$17 *$K$17*$B$17)","v":27840},{"$f":"M17/1000","v":27.84},{"$f":"(I17/360)*Advance_curve!F5 - N17","v":-3.0384126984126958},{"$f":"(360/I17)*O17","v":-6.1254399999999949}]
[]
[]
[]
[null,"http://syskb.com/creer-une-liste-deroulante-dans-excel-2010/"]
[]
[null,"TIMER 0",null,null,null,null,null,"Timer1",null,null,null,null,null,"F = (P/2)(N/60) => F=P*N/120"]
[null,"Quartz a 4MHz",null,null,null,null,null,"Quartz a 4MHz",null,null,null,null,null,"N: rpm",null,"P: Number of poles"]
[null,"- Fosc/4 or 4MHz/4 = 1MHz",null,null,null,null,null,"- Fosc/4 or 4MHz/4 = 1MHz"]
[null,"- Prescaler sur 256 dans le registre T0CON",null,null,null,null,null,"- Prescaler sur 8 dans le registre T1CON",null,null,null,null,null,"Tension produite:"]
[null,"- period of the frequency input to Timer 0 :",null,null,null,null,null,"- period of the frequency input to Timer 1 :",null,null,null,null,null,"Erms=(K * ω * N * θ ) / √2"]
[null,"1/(1MHz/256) = 256us",null,null,null,null,null,"1/(1MHz/8) = 8us",null,null,null,null,null,"Erms=4,44 * K * F * N * θ",null,null,null,"K=0,85 a 0,95 coef de bobinage"]
[null,"This is the period of time for each count in Timer 0 i.e.",null,null,null,null,null,"This is the period of time for each count in Timer 1 i.e."]
[null,"256 * 256us = 65536us = 65.636ms = 15.26Hz",null,null,null,null,null,"65536 * 8us = 525ms = 1,9Hz",null,null,null,null,null,"Courant produit:"]
[null,null,null,null,null,null,null,null,null,null,null,null,null,"I = (θ * N) / L"]
[null,"Lorsque TMR0=10, il s'est écoulé 10x256us = 2560us = 2,6ms."]
[null,"Si entre temps le moteur a fait 1 tour, c'est qu'il tourne a 2,56ms par tour"]
[null,"pour trouver des tours/mn: en 1mn (soit 60sec * 1000 = 60000ms)",null,null,null,null,null,"Calculator:"]
[null,"60000/2,56 = 23437 RPM",null,null,null,null,null,"http://eng-serve.com/pic/pic_timer.html"]
[]
[]
[null,"Conversion BIN to HEX:"]
[]
[null,"Position",8,7,6,5,4,3,2,1]
[null,"numero",7,6,5,4,3,2,1,0]
[null,"Puissance","2^3","2^2","2^1","2^0","2^3","2^2","2^1","2^0"]
[null,"Valeur 2x4bits",8,4,2,1,8,4,2,1]
[null,"Binaire",0,1,1,0,1,0,1,1]
[null,"Valeur",{"$f":"C44*C43","v":0},{"$f":"D44*D43","v":4},2,0,8,0,2,1]
[null,"2x4bits",{"$f":"C45+D45+E45+F45","v":6},null,null,null,{"$f":"G45+H45+I45+J45","v":11}]
[null,"Hexa 2x4bits",{"$f":"DEC2HEX(C46)","v":"6"},null,null,null,{"$f":"DEC2HEX(G46)","v":"B"}]
[null,"Hexa",{"$f":"CONCATENATE(C47,G47)","v":"6B"}]

{"sheet":"TIMERS","index":7,"n_rows":43,"n_cols":12,"rows_kept":43,"cut":false,"hidden":false,"merged":[]}
["16F1847"]
[]
[null,"TIMER 0 et TIMER2/4/6"]
[null,"Quartz a 4MHz",null,null,null,null,null,"Clock =",16,"MHz",null,"4MHz"]
[null,"- Fosc/4 or 4MHz/4 = 1MHz",null,null,null,null,null,"Instruction clock =",{"$f":"I4/4","v":4},"MHz"]
[null,"- Prescaler sur 256 dans le registre T0CON",null,null,null,null,null,"Instruction clock =",{"$f":"1/I5","v":0.25},"us"]
[null,"- period of the frequency input to Timer 0 :"]
[null,"1/(1MHz/256) = 256us",null,null,null,null,null,"Prescaler Timer0 de 8bits ",256,null,null,256]
[null,"This is the period of time for each count in Timer 0 i.e.",null,null,null,null,null,"Periode  Timer0",{"$f":"(I8/$I$5)","v":64},"µs"]
[null,"256 * 256us = 65536us = 65.636ms = 15.26Hz",null,null,null,null,null,"Débordement TMR0",{"$f":"256*I9","v":16384},"µs"]
[null,null,null,null,null,null,null,"Frq débordement TMR0",{"$f":"1000000/I10","v":61.03515625},"Hz"]
[null,"Lorsque TMR0=10, il s'est écoulé 10x256us = 2560us = 2,6ms.",null,null,null,null,null,"Incrément de TMR0H",{"$f":"I10/1000","v":16.384},"ms",null,"65,54ms"]
[null,"Si entre temps le moteur a fait 1 tour, c'est qu'il tourne a 2,56ms par tour"]
[null,"pour trouver des tours/mn: en 1mn (soit 60sec * 1000 = 60000ms)"]
[null,"60000/2,56 = 23437 RPM",null,null,null,null,null,"Prescaler Timer1 de 16bits",8,null,null,2]
[null,null,null,null,null,null,null,"Periode  Timer1L",{"$f":"(I15/$I$5)","v":2},"µs"]
[null,"Timer1",null,null,null,null,null,"Periode  Timer1H",{"$f":"(I16*256)","v":512},"µs"]
[null,"Quartz a 4MHz",null,null,null,null,null,"Débordement TMR1",{"$f":"65636*I16","v":131272},"µs",{"$f":"I18/1000","v":131.27199999999999},"ms"]
[null,"- Fosc/4 or 4MHz/4 = 1MHz",null,null,null,null,null,"Frq débordement TMR1",{"$f":"1000000/I18","v":7.6177707355719422},"Hz",null,"7,62hz"]
[null,"- Prescaler sur 8 dans le registre T1CON"]
[null,"- period of the frequency input to Timer 1 :"]
[null,"1/(1MHz/8) = 8us"]
[null,"This is the period of time for each count in Timer 1 i.e.",null,null,null,null,null,"Prescaler Timer2 de 8bits ",1,null,null,1]
[null,"65536 * 8us = 525ms = 1,9Hz",null,null,null,null,null,"Periode  Timer2",{"$f":"(I23/$I$5)","v":0.25},"µs"]
[null,null,null,null,null,null,null,"Débordement TMR2",{"$f":"256*I24","v":64},"µs"]
[null,"Calculator:",null,null,null,null,null,"Frq débordement TMR2",{"$f":"1000000/I25","v":15625},"Hz",null,"3906Hz"]
[null,"http://eng-serve.com/pic/pic_timer.html"]
[]
[]
[null,"================== TIMER1 ================"]
[null,"Compteur 16bits, donc 65536 max. 1 increment par us"]
[]
[null,"Avec Clock 4MHz:"]
[null,"PRESC=1 => TMR1H s'incremente de 1 en 256us,  deborde toutes les 65ms"]
[null,"PRESC=2 => TMR1H s'incremente de 1 en 512us,  deborde ici toutes les 131ms"]
[null,"PRESC=4 => TMR1H s'incremente de 1 en 1024us, deborde ici toutes les 262ms"]
[null,"PRESC=8 => TMR1H s'incremente de 1 en 2048us, deborde ici toutes les 525ms"]
[]
[null,"Avec Clock 16MHz:"]
[null,"PRESC=1 => TMR1H s'incrémente de 1 en  64us. Déborde en 16ms"]
[null,"PRESC=2 => TMR1H s'incrémente de 1 en 128us. Déborde en 32ms <==="]
[null,"PRESC=4 => TMR1H s'incrémente de 1 en 256us. Déborde en 65ms"]
[null,"PRESC=8 => TMR1H s'incrémente de 1 en 512us. Déborde en 131ms"]

{"sheet":"Calculs","index":8,"n_rows":38,"n_cols":6,"rows_kept":38,"cut":false,"hidden":false,"merged":[]}
[]
["- Tant que pickup est bas (=0) 99% du temps, on met la valeur du TIMER0 dans la variable PERL (PERiode Low)"]
["- Chaque fois que TIMER0 provoque une INTerruption de debordement lorsqu'il arrive a 255,  dans la routine d'interruption on incremente TMR0H (TIMER0 High)"]
["- Quand le pickup est haut (=1) (pulse) :"]
["- on memorise la valeur de TMR0H (Nbr de debordements de TIMER0), dans PERH (PERiode High)"]
["- et on memorise aussi la valeur du TIMER0 dans la variable PERL."]
["- puis on RAZ les timers,"]
[]
["- Ainsi la durée ecoulé entre 2 pickups est stockée dans PERL et PERH.   Soit : (PERH x 255 ) + PERL"]
[]
["Avec Q=4MHz, Prescaler = 256 et Preset = 0"]
["TIMER0 s'incremente toutes les 256us et deborde toutes les 256x256= 65536us = 65,5ms = 15,25Hz"]
["(utiliser: E:\\Pic\\Exemples\\pic_calculations.xls)"]
["- donc [ (PERH * 255 ) + PERL ] * 65,5ms = durée entre 2 pulses."]
[]
["- Dans le soft:"]
["- on regarde si PERH est > a une certaine valeur, auquel cas le moteur tourne très lentement"]
["- on regarde si PERL est < a une certaine valeur, auquel cas le moteur tourne trop vite => arret des sparks pour limiter le regime"]
["- on regarde si PERL est < a une certaine valeur, auquel cas le moteur tourne très vite => spark immediat (sans avance)"]
["- entre ces 2 limites, on lit un tableau qui retourne un chiffre (delay) pour chacune des 95 valeurs de PERL"]
["- ce DELAY est le temps d'attente (nbr de boucles d'atttente) avant d'envoyer le spark"]
[]
["Propriete de l'interruption:"]
[]
[]
[null,null,null,null,null,"Liste deroulante"]
[null,null,null,null,null,"selectionner la cellule "]
[null,null,null,null,null,"donnees> validité des données> validite des donnees > afficher: liste"]
[]
[]
[]
[]
[]
[]
[]
[]
[]
["A 15,4Hz = 924RPM, il faut 64935us pour faire un tour, donc TIMER0 a le temps d'aller jusqu’à 254 et de presque deborder:"]

{"sheet":"Dwell variable","index":9,"n_rows":98,"n_cols":5,"rows_kept":98,"cut":false,"hidden":false,"merged":[]}
[]
[null,null,null,"coef:","DWELL = PERIODE * 50"]
[null,{"$f":"Advance_curve!B8","v":"TIMER1H count"},null,50]
[null,{"$f":"Advance_curve!B9","v":23},{"$f":"$D$3*Advance_curve!B9","v":1150},"µs"]
[null,{"$f":"Advance_curve!B10","v":24},{"$f":"$D$3*Advance_curve!B10","v":1200}]
[null,{"$f":"Advance_curve!B11","v":25},{"$f":"$D$3*Advance_curve!B11","v":1250}]
[null,{"$f":"Advance_curve!B12","v":26},{"$f":"$D$3*Advance_curve!B12","v":1300}]
[null,{"$f":"Advance_curve!B13","v":27},{"$f":"$D$3*Advance_curve!B13","v":1350}]
[null,{"$f":"Advance_curve!B14","v":28},{"$f":"$D$3*Advance_curve!B14","v":1400}]
[null,{"$f":"Advance_curve!B15","v":29},{"$f":"$D$3*Advance_curve!B15","v":1450}]
[null,{"$f":"Advance_curve!B16","v":30},{"$f":"$D$3*Advance_curve!B16","v":1500}]
[null,{"$f":"Advance_curve!B17","v":31},{"$f":"$D$3*Advance_curve!B17","v":1550}]
[null,{"$f":"Advance_curve!B18","v":32},{"$f":"$D$3*Advance_curve!B18","v":1600}]
[null,{"$f":"Advance_curve!B19","v":33},{"$f":"$D$3*Advance_curve!B19","v":1650}]
[null,{"$f":"Advance_curve!B20","v":34},{"$f":"$D$3*Advance_curve!B20","v":1700}]
[null,{"$f":"Advance_curve!B21","v":35},{"$f":"$D$3*Advance_curve!B21","v":1750}]
[null,{"$f":"Advance_curve!B22","v":36},{"$f":"$D$3*Advance_curve!B22","v":1800}]
[null,{"$f":"Advance_curve!B23","v":37},{"$f":"$D$3*Advance_curve!B23","v":1850}]
[null,{"$f":"Advance_curve!B24","v":38},{"$f":"$D$3*Advance_curve!B24","v":1900}]
[null,{"$f":"Advance_curve!B25","v":39},{"$f":"$D$3*Advance_curve!B25","v":1950}]
[null,{"$f":"Advance_curve!B26","v":40},{"$f":"$D$3*Advance_curve!B26","v":2000}]
[null,{"$f":"Advance_curve!B27","v":41},{"$f":"$D$3*Advance_curve!B27","v":2050}]
[null,{"$f":"Advance_curve!B28","v":42},{"$f":"$D$3*Advance_curve!B28","v":2100}]
[null,{"$f":"Advance_curve!B29","v":43},{"$f":"$D$3*Advance_curve!B29","v":2150}]
[null,{"$f":"Advance_curve!B30","v":44},{"$f":"$D$3*Advance_curve!B30","v":2200}]
[null,{"$f":"Advance_curve!B31","v":45},{"$f":"$D$3*Advance_curve!B31","v":2250}]
[null,{"$f":"Advance_curve!B32","v":46},{"$f":"$D$3*Advance_curve!B32","v":2300}]
[null,{"$f":"Advance_curve!B33","v":47},{"$f":"$D$3*Advance_curve!B33","v":2350}]
[null,{"$f":"Advance_curve!B34","v":48},{"$f":"$D$3*Advance_curve!B34","v":2400}]
[null,{"$f":"Advance_curve!B35","v":49},{"$f":"$D$3*Advance_curve!B35","v":2450}]
[null,{"$f":"Advance_curve!B36","v":50},{"$f":"$D$3*Advance_curve!B36","v":2500}]
[null,{"$f":"Advance_curve!B37","v":51},{"$f":"$D$3*Advance_curve!B37","v":2550}]
[null,{"$f":"Advance_curve!B38","v":52},{"$f":"$D$3*Advance_curve!B38","v":2600}]
[null,{"$f":"Advance_curve!B39","v":53},{"$f":"$D$3*Advance_curve!B39","v":2650}]
[null,{"$f":"Advance_curve!B40","v":54},{"$f":"$D$3*Advance_curve!B40","v":2700}]
[null,{"$f":"Advance_curve!B41","v":55},{"$f":"$D$3*Advance_curve!B41","v":2750}]
[null,{"$f":"Advance_curve!B42","v":56},{"$f":"$D$3*Advance_curve!B42","v":2800}]
[null,{"$f":"Advance_curve!B43","v":57},{"$f":"$D$3*Advance_curve!B43","v":2850}]
[null,{"$f":"Advance_curve!B44","v":58},{"$f":"$D$3*Advance_curve!B44","v":2900}]
[null,{"$f":"Advance_curve!B45","v":59},{"$f":"$D$3*Advance_curve!B45","v":2950}]
[null,{"$f":"Advance_curve!B46","v":60},{"$f":"$D$3*Advance_curve!B46","v":3000}]
[null,{"$f":"Advance_curve!B47","v":61},{"$f":"$D$3*Advance_curve!B47","v":3050}]
[null,{"$f":"Advance_curve!B48","v":62},{"$f":"$D$3*Advance_curve!B48","v":3100}]
[null,{"$f":"Advance_curve!B49","v":63},{"$f":"$D$3*Advance_curve!B49","v":3150}]
[null,{"$f":"Advance_curve!B50","v":64},{"$f":"$D$3*Advance_curve!B50","v":3200}]
[null,{"$f":"Advance_curve!B51","v":65},{"$f":"$D$3*Advance_curve!B51","v":3250}]
[null,{"$f":"Advance_curve!B52","v":66},{"$f":"$D$3*Advance_curve!B52","v":3300}]
[null,{"$f":"Advance_curve!B53","v":67},{"$f":"$D$3*Advance_curve!B53","v":3350}]
[null,{"$f":"Advance_curve!B54","v":68},{"$f":"$D$3*Advance_curve!B54","v":3400}]
[null,{"$f":"Advance_curve!B55","v":69},{"$f":"$D$3*Advance_curve!B55","v":3450}]
[null,{"$f":"Advance_curve!B56","v":70},{"$f":"$D$3*Advance_curve!B56","v":3500}]
[null,{"$f":"Advance_curve!B57","v":71},{"$f":"$D$3*Advance_curve!B57","v":3550}]
[null,{"$f":"Advance_curve!B58","v":72},{"$f":"$D$3*Advance_curve!B58","v":3600}]
[null,{"$f":"Advance_curve!B59","v":73},{"$f":"$D$3*Advance_curve!B59","v":3650}]
[null,{"$f":"Advance_curve!B60","v":74},{"$f":"$D$3*Advance_curve!B60","v":3700}]
[null,{"$f":"Advance_curve!B61","v":75},{"$f":"$D$3*Advance_curve!B61","v":3750}]
[null,{"$f":"Advance_curve!B62","v":76},{"$f":"$D$3*Advance_curve!B62","v":3800}]
[null,{"$f":"Advance_curve!B63","v":77},{"$f":"$D$3*Advance_curve!B63","v":3850}]
[null,{"$f":"Advance_curve!B64","v":78},{"$f":"$D$3*Advance_curve!B64","v":3900}]
[null,{"$f":"Advance_curve!B65","v":79},{"$f":"$D$3*Advance_curve!B65","v":3950}]
[null,{"$f":"Advance_curve!B66","v":80},{"$f":"$D$3*Advance_curve!B66","v":4000}]
[null,{"$f":"Advance_curve!B67","v":81},{"$f":"$D$3*Advance_curve!B67","v":4050}]
[null,{"$f":"Advance_curve!B68","v":82},{"$f":"$D$3*Advance_curve!B68","v":4100}]
[null,{"$f":"Advance_curve!B69","v":83},{"$f":"$D$3*Advance_curve!B69","v":4150}]
[null,{"$f":"Advance_curve!B70","v":84},{"$f":"$D$3*Advance_curve!B70","v":4200}]
[null,{"$f":"Advance_curve!B71","v":85},{"$f":"$D$3*Advance_curve!B71","v":4250}]
[null,{"$f":"Advance_curve!B72","v":86},{"$f":"$D$3*Advance_curve!B72","v":4300}]
[null,{"$f":"Advance_curve!B73","v":87},{"$f":"$D$3*Advance_curve!B73","v":4350}]
[null,{"$f":"Advance_curve!B74","v":88},{"$f":"$D$3*Advance_curve!B74","v":4400}]
[null,{"$f":"Advance_curve!B75","v":89},{"$f":"$D$3*Advance_curve!B75","v":4450}]
[null,{"$f":"Advance_curve!B76","v":90},{"$f":"$D$3*Advance_curve!B76","v":4500}]
[null,{"$f":"Advance_curve!B77","v":91},{"$f":"$D$3*Advance_curve!B77","v":4550}]
[null,{"$f":"Advance_curve!B78","v":92},{"$f":"$D$3*Advance_curve!B78","v":4600}]
[null,{"$f":"Advance_curve!B79","v":93},{"$f":"$D$3*Advance_curve!B79","v":4650}]
[null,{"$f":"Advance_curve!B80","v":94},{"$f":"$D$3*Advance_curve!B80","v":4700}]
[null,{"$f":"Advance_curve!B81","v":95},{"$f":"$D$3*Advance_curve!B81","v":4750}]
[null,{"$f":"Advance_curve!B82","v":96},{"$f":"$D$3*Advance_curve!B82","v":4800}]
[null,{"$f":"Advance_curve!B83","v":97},{"$f":"$D$3*Advance_curve!B83","v":4850}]
[null,{"$f":"Advance_curve!B84","v":98},{"$f":"$D$3*Advance_curve!B84","v":4900}]
[null,{"$f":"Advance_curve!B85","v":99},{"$f":"$D$3*Advance_curve!B85","v":4950}]
[null,{"$f":"Advance_curve!B86","v":100},{"$f":"$D$3*Advance_curve!B86","v":5000}]
[null,{"$f":"Advance_curve!B87","v":101},{"$f":"$D$3*Advance_curve!B87","v":5050}]
[null,{"$f":"Advance_curve!B88","v":102},{"$f":"$D$3*Advance_curve!B88","v":5100}]
[null,{"$f":"Advance_curve!B89","v":103},{"$f":"$D$3*Advance_curve!B89","v":5150}]
[null,{"$f":"Advance_curve!B90","v":104},{"$f":"$D$3*Advance_curve!B90","v":5200}]
[null,{"$f":"Advance_curve!B91","v":105},{"$f":"$D$3*Advance_curve!B91","v":5250}]
[null,{"$f":"Advance_curve!B92","v":106},{"$f":"$D$3*Advance_curve!B92","v":5300}]
[null,{"$f":"Advance_curve!B93","v":107},{"$f":"$D$3*Advance_curve!B93","v":5350}]
[null,{"$f":"Advance_curve!B94","v":108},{"$f":"$D$3*Advance_curve!B94","v":5400}]
[null,{"$f":"Advance_curve!B95","v":109},{"$f":"$D$3*Advance_curve!B95","v":5450}]
[null,{"$f":"Advance_curve!B96","v":110},{"$f":"$D$3*Advance_curve!B96","v":5500}]
[null,{"$f":"Advance_curve!B97","v":111},{"$f":"$D$3*Advance_curve!B97","v":5550}]
[null,{"$f":"Advance_curve!B98","v":112},{"$f":"$D$3*Advance_curve!B98","v":5600}]
[null,{"$f":"Advance_curve!B99","v":113},{"$f":"$D$3*Advance_curve!B99","v":5650}]
[null,{"$f":"Advance_curve!B100","v":114},{"$f":"$D$3*Advance_curve!B100","v":5700}]
[null,{"$f":"Advance_curve!B101","v":115},{"$f":"$D$3*Advance_curve!B101","v":5750}]
[null,{"$f":"Advance_curve!B102","v":116},{"$f":"$D$3*Advance_curve!B102","v":5800}]
[null,{"$f":"Advance_curve!B103","v":117},{"$f":"$D$3*Advance_curve!B103","v":5850}]

{"sheet":"Version","index":10,"n_rows":62,"n_cols":2,"rows_kept":62,"cut":false,"hidden":false,"merged":[]}
[]
[]
[]
["v7.9r13c2","[HARD] Correction RA1 forcé a 1, car pullup R5 sur PCB"]
["v7.9r13c3","[XLS] Valeur de dwell passe de 2 choix (500,1000) a 6 choix (500,1000,2000,3000,4000,5000)."]
["v7.9r14c0","[SOFT,XLS] Ajout d'une valeur de dwell \"AUTO\" pour lequel la durée de dwell est proportionnelle a PERIODE."]
["v7.9r14c1","[SOFT] Code protection OFF"]
["v7.9r15c0","[XLS] La vlaleur d'avance affichée dans l'onglet \"advance_at_lowRPM\" ne prenait pas en compte la position du pickup, c'était donc une valeur RELATIVE, pas ABSOLUE. Multiplicateur peut descendre a 1 (soft OK)"]
[null,"[SOFT] si JP2 a la masse alors PIC bypass la courbe d'avance et envoi spark dés que detection front descendant du pickup"]
[null,"[SOFT] RB3 (ex TP2) n'était pas forcé en OUTPUT"]
[null,"[HARD] Suppression TP2 inutile"]
[null,"[HARD] Reduction R7 de 330 a 180 (Sinon ne declenche pas les SCR de type BTA)."]
[null,"[HARD] Suppression C9-100n car courant d'appel dépasse Imax du PIC"]
["v7.9r16c0","[XLS] La valeur d'avance affichée dans l'onglet \"advance_at_lowRPM\" était fausse."]
[null,"[SOFT] boucles d'attente pkp haut et bas en ASM: Precision x10 !!"]
[null,"[XLS] Ajout documentation onglet README"]
["v7.9r16c1","[XLS] Tuning: a low RPM, le PIC attend 4us x PERIODE mais en vrai bcl dure plus de 4us, du coup il y a un offset de 5deg (20° affiché et 15° reels)\npour simplifier correction: la valeur delay (I1) passe de 4 a 4.4"]
[null,"[SOFT] Calibration de la boucle 40us"]
["v7.9r17c0","[XLS] Ajout d'un Rev Limiter a l'adresse Eprom 121 si swich JP2 a la masse"]
[null,"[SOFT] JP2 (ex Bypass curve) est utilisé pour activer une limitation de RPM inferieur au maxi et stocké en @121 de l'eprom (Scooter légal)"]
["v7.9r17c1","[XLS] Renommage en accord avec code. Ajout RPM mini dans le titre onglet low_rpm"]
["v7.9r18c0","[XLS] Ajout d'un délai at Kick Start selectionnable par le user"]
[null,"[SOFT] Si TMR1 déborde, PIC attend une pause de Nbr débordements * VLRPM qui a été définie par le user et écrite en eprom. Sinon spark immediate entre 0 et 480RPM car TMR1 = 0 = croit que RPM élévés"]
["v7.9r21c0","[SOFT] horloge passe de 4 a 16MHz (*4), Prescaler passe de 2 a 8 pour conserver meme valeurs de PERIODE, Boucles ASM de 100,40,20us contiennent 4 fois plus de NOP pour conserver meme durées"]
[null,"[XLS] comme horloge passe de 4 a 16MHz (*4), incompressible delai passe de 72 a 18 (/4) (non verifié), cellule I5"]
[null,"[XLS] Prescaler par defaut = 8 (au lieu de 2) cellule O26"]
[null,"[XLS] et modif calcul RPM cellule C9 ($B9*64 au lieu $B9*255)"]
[null,"[XLS] Ajout d'une colonne correction pour diminuer le nbr de boucle a haut RPM car FC ajoute un certain temps a chaque bcl ASM du coup la durée est variable selon le nbr de bcl"]
["v7.9r3c1","[XLS] Ajout colonne MCH format pour Eprom sous MPLAB"]
[null,"[XLS] Correction calcul TMR1H dans \"advance_at_lowRPM\" car 16MHz (PER/PRESC*64) Pour 4MHz: PER/PRESC/256)"]
[null,"[XLS] Suppression Rev limiter avec JP2 et suppression VLRPM d'une durée fixe"]
[null,"[XLS] Adv_low_rpm modification: affichage ligne droite jusqu'au mini lié a la limitiation du nbr de débord TMR1 (42 a 332rpm)"]
[null,"[SOFT] Variable VLRPM contient maintenant le temps en ms a attendre avant spark pour chaque débord TMR1 de manière a avoir une avance de 0°BTDC"]
["v7.9r4c0","[XLS] Ajout du type DC ou AC dans le contenu de l'eprom avec la version"]
[null,"[XLS] Ajout step de 200us pour autoriser pickup position > 180°"]
[null,"[XLS] Correction calcul Correcteur. Ne fonctionnait pas pour step de 100 or 200us"]
[null,"[SOFT] Ajout step de 200us pour autoriser pickup position > 180°"]
["v7.9r5c0","[XLS] Pas de changement , juste renommage en v79r5. Effacement du nom 16F1847 car meme fichier xls pour 1827,1825, Modif des Warning colonne M et du warning recap en F6. Affichage précis du range modifiable dans \"advance_lowrpm\""]
[null,"[SOFT] Portage sur 16F1827 plus courant."]
["v7.9r6c0","[SOFT] Apres 1.2sec sans pulse, PWM s'arrete: conso chute de 0.2w a 0.02w. Reduction PWM mini au demarrage a 10%. DC passe de 40 a 80% pour augmenter tension de sortie."]
["v7.9r7c0","[SOFT] Remplacement des bcl 100 & 200us par de l'ASM. Il faut utiliser INT pour eviter que PIC saute des pkp lorque il y a synchro aleatoire\nentre pickup et PIC qui revient attendre un rising edge. Si le pkp est a 1, PIC le saute."]
["v7.9r7c1","[SOFT] RAZ TMR1DEB dans 1er tour mesure. Deplacement IOC avant le 1er tour moteur. Correction: pas de spark a 7.5Hz/447Hz et 200Hz car DEB=1 et PER=0 donc no spark!=> Forcage de PERIODE a TMR1min (ne pas mettre 1 sinon no spark). /!\\  Arret INT avant boucle TMR1DEB remise a la fin pour pas interrompre\nprovoque 1000 a 4000 = -180° env"]
["v7.9r7c2","[SOFT] Retrait de l'arret INT avant boucle TMR1DEB car INT semble ne pas se réactiver ensuite....!\n/!\\MCLR doit etre disable dans Options sinon reboot en boucle. DEFAUT: Si pickup est long et délai court, PIC envoi 2 spark durant pickup ! Mettre dans Main en tout 1er une bcl ASM pkp until 1"]
["v7.9r7c3","[SOFT] Correction: Rajout d'une bcl ASM d'attente de fin de niveau haut. Indispensable si pickup a 1 long et délai court: le PIC revient apres la spark, voit niveau 1 et rapplique délai et nouvelle spark : DEFAUT: a 8Hz, 10Hz le PIC saute des pickup. (cause pbl entre PWM et TIMER? ou pbl d'INT?) Palliatif: Remplacement de PWM 20% pas MOSFET forcé a 1 entre pkp et spark. Soft reste en bcl si pkp longtemps a 0 ou a 1: Ajout d'un FLAGDELAI pour ne pas rafraichir TMR1DEB. TMR1DEB limité a 40/PRESCALER au lieu de 10 fixe. Ajout d'un FLAGSPARK pour eviter 2 sparks si deja fait."]
["v7.9r7c4","[SOFT] Pas de spark entre 470-1000rpm: Venait de PWM Enable/Disable laisse la sortie à 1 en haute impédance. (Incapable de fournir du courant au Mosfet) Modif: Converter ON entre spark et pickup. Imbrication des 2 controles \"DEB TMR1\" et \"LOW_RPM\" car il y avait passage dans les 2 a la suite\net donc 2 sparks (car pas de lecture du FLAG dans le 2em). "]
["v7.9r7c5","[SOFT] Apres qq minutes le DC converter s'arrete (surchauffe?) Modif: Converter ON entre pickup et spark(durant délai) au lieu de spark et pickup: bien + court, chauffe -. Deplacement config TMR1 dans une macro (non testé)"]
["v7.9r7c6","[SOFT]  Pas d'etincelle. DC converter pas alimenté assez longtemps selon valeur délai. Modif: Converter ON entre spark et pickup AVEC 50ms d'attente de fin spark pour eviter converter ON sur CC"]
[null,"[XLS] Pas de modif mais renommage version"]
["v7.9r7c7","[XLS] Modif choix 2,4 stk wasted spark"]
[null,"[XLS] Correction. Le temps en us pour 1° changeait selon 2 ou 4tps ! (faux en 4)"]
["v7.9r7c8","[XLS] Ajout de la duree d'hysteresis 400us qui décalle le debut du délai avance. Cell I5"]
[null,"[XLS] Modif formule colonne I si < incompressible alors \"0\""]
[null,"[XLS] Ajout possibilité décaller VLRPM meme feuille protegée"]
[null,"[XLS] Correction Hash checksum"]
[null,"[XLS] Calibrage MPLAB délai incompressible: 25us + 365us de RB4_INT,  RAS de la colonne calibration. Pas besoin pour l'instant"]
["v7.9r7c9","[XLS] 50 trials dans version Free"]
[null,"[XLS] Report nbr de temps 2/4 dans eeprom K18"]
[null,"[SOFT] [XLS] Choix clignotement led au startup o/n"]
[null,"[XLS] y=2,42+5,18E-3*x"]
["v7.9r7c10","[XLS] ERROR N°2: dans adv_low_rpm a 10Hz/600rpm il est censé y avoir délai: 10ms mais 50ms en vrai !!"]
[null,"[XLS] Correction dans le calcul de la valeur de TMR1h qui ne tenait pas compte de la clock!"]
["v7.9r7c11","[XLS] Correction, la colonne FRQ devait etre calculée d'apres TMR1 et non d'apres RPM. Maintenant c'est logique si on change 2tps ou 4tps"]

{"sheet":"Excel","index":11,"n_rows":10,"n_cols":3,"rows_kept":10,"cut":false,"hidden":false,"merged":[]}
[]
[]
["Conversion de valeurs: ",null,"=SI(I2=2;2;(SI(I2=3;3;(SI(I2=4;4;(SI(I2=5;5;(SI(I2=6;6)))))))))"]
[]
["Liste deroulante: ",null,"Donnees> Validite des donnees"]
[]
[]
["les graphes n'affichent pas la valeur #N/A  , utiliser #N/A pour faire disparaitre les points du graphe"]
[]
["Pour afficher les liens d'une cellule: selectionnez-la > Formule > Reperer les antécédents/dependants "]

{"sheet":"calibrage","index":12,"n_rows":36,"n_cols":12,"rows_kept":36,"cut":false,"hidden":false,"merged":[]}
[]
[null,"RPM","HZ","ms","us","1°","XLS","nb loop","Tester","Ecart","Ecart","Ecart/loop"]
[1,1000,{"$f":"(2*formules!$D$3*B3)/(60*formules!$C$3)","v":16.666666666666668},{"$f":"1000*(60*formules!$C$3)/(2*formules!$D$3*B3)","v":60},{"$f":"D3*1000","v":60000},"us","°btdc",null,"°btdc","°","us","us"]
[2,1500,{"$f":"(2*formules!$D$3*B4)/(60*formules!$C$3)","v":25},{"$f":"1000*(60*formules!$C$3)/(2*formules!$D$3*B4)","v":40},{"$f":"D4*1000","v":40000}]
[3,2000,{"$f":"(2*formules!$D$3*B5)/(60*formules!$C$3)","v":33.333333333333336},{"$f":"1000*(60*formules!$C$3)/(2*formules!$D$3*B5)","v":30},30000]
[4,2500,{"$f":"(2*formules!$D$3*B6)/(60*formules!$C$3)","v":41.666666666666664},{"$f":"1000*(60*formules!$C$3)/(2*formules!$D$3*B6)","v":24},24000]
[5,3000,{"$f":"(2*formules!$D$3*B7)/(60*formules!$C$3)","v":50},{"$f":"1000*(60*formules!$C$3)/(2*formules!$D$3*B7)","v":20},20000,56,34,36,27,{"$f":"G7-I7","v":7},{"$f":"J7*F7","v":392},{"$f":"K7/H7","v":10.888888888888889}]
[6,3500,{"$f":"(2*formules!$D$3*B8)/(60*formules!$C$3)","v":58.333333333333336},{"$f":"1000*(60*formules!$C$3)/(2*formules!$D$3*B8)","v":17.142857142857142},17142.857142857141]
[7,4000,{"$f":"(2*formules!$D$3*B9)/(60*formules!$C$3)","v":66.666666666666671},{"$f":"1000*(60*formules!$C$3)/(2*formules!$D$3*B9)","v":15},15000]
[8,4500,{"$f":"(2*formules!$D$3*B10)/(60*formules!$C$3)","v":75},{"$f":"1000*(60*formules!$C$3)/(2*formules!$D$3*B10)","v":13.333333333333334},13333.333333333334]
[9,5000,{"$f":"(2*formules!$D$3*B11)/(60*formules!$C$3)","v":83.333333333333329},{"$f":"1000*(60*formules!$C$3)/(2*formules!$D$3*B11)","v":12},12000,33,43,13,33,{"$f":"G11-I11","v":10},{"$f":"J11*F11","v":330},{"$f":"K11/H11","v":25.384615384615383}]
[10,5500,{"$f":"(2*formules!$D$3*B12)/(60*formules!$C$3)","v":91.666666666666671},{"$f":"1000*(60*formules!$C$3)/(2*formules!$D$3*B12)","v":10.909090909090908},10909.090909090908]
[11,6000,{"$f":"(2*formules!$D$3*B13)/(60*formules!$C$3)","v":100},{"$f":"1000*(60*formules!$C$3)/(2*formules!$D$3*B13)","v":10},10000]
[12,6500,{"$f":"(2*formules!$D$3*B14)/(60*formules!$C$3)","v":108.33333333333333},{"$f":"1000*(60*formules!$C$3)/(2*formules!$D$3*B14)","v":9.2307692307692299},9230.7692307692305]
[13,7000,{"$f":"(2*formules!$D$3*B15)/(60*formules!$C$3)","v":116.66666666666667},{"$f":"1000*(60*formules!$C$3)/(2*formules!$D$3*B15)","v":8.5714285714285712},8571.4285714285706,24,47,7,34,{"$f":"G15-I15","v":13},{"$f":"J15*F15","v":312},{"$f":"K15/H15","v":44.571428571428569}]
[14,7500,{"$f":"(2*formules!$D$3*B16)/(60*formules!$C$3)","v":125},{"$f":"1000*(60*formules!$C$3)/(2*formules!$D$3*B16)","v":8},8000]
[15,8000,{"$f":"(2*formules!$D$3*B17)/(60*formules!$C$3)","v":133.33333333333334},{"$f":"1000*(60*formules!$C$3)/(2*formules!$D$3*B17)","v":7.5},7500]
[16,8500,{"$f":"(2*formules!$D$3*B18)/(60*formules!$C$3)","v":141.66666666666666},{"$f":"1000*(60*formules!$C$3)/(2*formules!$D$3*B18)","v":7.0588235294117645},7058.8235294117649]
[17,9000,{"$f":"(2*formules!$D$3*B19)/(60*formules!$C$3)","v":150},{"$f":"1000*(60*formules!$C$3)/(2*formules!$D$3*B19)","v":6.666666666666667},6666.666666666667]
[18,9500,{"$f":"(2*formules!$D$3*B20)/(60*formules!$C$3)","v":158.33333333333334},{"$f":"1000*(60*formules!$C$3)/(2*formules!$D$3*B20)","v":6.3157894736842106},6315.7894736842109]
[19,10000,{"$f":"(2*formules!$D$3*B21)/(60*formules!$C$3)","v":166.66666666666666},{"$f":"1000*(60*formules!$C$3)/(2*formules!$D$3*B21)","v":6},6000]
[20,10500,{"$f":"(2*formules!$D$3*B22)/(60*formules!$C$3)","v":175},{"$f":"1000*(60*formules!$C$3)/(2*formules!$D$3*B22)","v":5.7142857142857144},5714.2857142857147]
[21,11000,{"$f":"(2*formules!$D$3*B23)/(60*formules!$C$3)","v":183.33333333333334},{"$f":"1000*(60*formules!$C$3)/(2*formules!$D$3*B23)","v":5.4545454545454541},5454.545454545454]
[22,11500,{"$f":"(2*formules!$D$3*B24)/(60*formules!$C$3)","v":191.66666666666666},{"$f":"1000*(60*formules!$C$3)/(2*formules!$D$3*B24)","v":5.2173913043478262},5217.391304347826]
[23,12000,{"$f":"(2*formules!$D$3*B25)/(60*formules!$C$3)","v":200},{"$f":"1000*(60*formules!$C$3)/(2*formules!$D$3*B25)","v":5},5000]
[24,12500,{"$f":"(2*formules!$D$3*B26)/(60*formules!$C$3)","v":208.33333333333334},{"$f":"1000*(60*formules!$C$3)/(2*formules!$D$3*B26)","v":4.8},4800]
[25,13000,{"$f":"(2*formules!$D$3*B27)/(60*formules!$C$3)","v":216.66666666666666},{"$f":"1000*(60*formules!$C$3)/(2*formules!$D$3*B27)","v":4.615384615384615},4615.3846153846152]
[26,13500,{"$f":"(2*formules!$D$3*B28)/(60*formules!$C$3)","v":225},{"$f":"1000*(60*formules!$C$3)/(2*formules!$D$3*B28)","v":4.4444444444444446},4444.4444444444443]
[27,14000,{"$f":"(2*formules!$D$3*B29)/(60*formules!$C$3)","v":233.33333333333334},{"$f":"1000*(60*formules!$C$3)/(2*formules!$D$3*B29)","v":4.2857142857142856},4285.7142857142853]
[]
[]
[null,"Temps incompressible a 4MHz:",null,null,"avec délai = 0 dans l'eprom, il faut 71us entre la detection pickup haut et spark"]
[null,null,null,null,"avec délai = 1 dans l'eprom, il faut 91us entre la detection pickup haut et spark (soit 71us +20us)"]
[]
[null,"Temps incompressible a 16MHz:",null,null,"avec délai = 0 dans l'eprom, il faut 50us entre la detection pickup haut et spark"]
[null,null,null,null,"Pas verifié. On suppose que c'est 71us / 4 = 18us"]

{"sheet":"Error","index":13,"n_rows":50,"n_cols":17,"rows_kept":50,"cut":false,"hidden":false,"merged":[]}
[null,"prescaler: 8","step 40us","data= ZERO","Pkp position: 60"]
[]
[]
[null,null,null,null,null,null,null,null,null,null,null,null,null,null,null,"En theorie la ligne devrait etre droite a 60°"]
[null,null,null,null,null,null,null,null,null,null,null,null,null,null,"1000|12,96","il y a un délai FIXE de 250us c'est le temps de démarrage du DC converter du Tester v5"]
[null,null,null,null,null,null,null,null,null,null,null,null,null,null,"1200|58,24"]
[null,null,null,null,null,null,null,null,null,null,null,null,null,null,"1400|57,99"]
[null,null,null,null,null,null,null,null,null,null,null,null,null,null,"1600|57,71"]
[]
[null,null,null,null,null,null,null,null,null,null,null,null,null,null,"2000|57,26"]
[null,null,null,null,null,null,null,null,null,null,null,null,null,null,"2200|56,84"]
[null,null,null,null,null,null,null,null,null,null,null,null,null,null,"2400|56,39"]
[null,null,null,null,null,null,null,null,null,null,null,null,null,null,"2600|56,43"]
[]
[null,null,null,null,null,null,null,null,null,null,null,null,null,null,"3000|55,75"]
[null,null,null,null,null,null,null,null,null,null,null,null,null,null,"3200|55,58"]
[null,null,null,null,null,null,null,null,null,null,null,null,null,null,"3400|54,81"]
[null,null,null,null,null,null,null,null,null,null,null,null,null,null,"3600|54,51"]
[null,null,null,null,null,null,null,null,null,null,null,null,null,null,"3800|54,67"]
[null,null,null,null,null,null,null,null,null,null,null,null,null,null,"4000|53,98"]
[null,null,null,null,null,null,null,null,null,null,null,null,null,null,"4200|54,16"]
[null,null,null,null,null,null,null,null,null,null,null,null,null,null,"4400|53,24"]
[null,null,null,null,null,null,null,null,null,null,null,null,null,null,"4600|52,95"]
[null,null,null,null,null,null,null,null,null,null,null,null,null,null,"4800|52,47"]
[null,null,null,null,null,null,null,null,null,null,null,null,null,null,"5000|52,5"]
[]
[null,null,null,null,null,null,null,null,null,null,null,null,null,null,"5400|51,95"]
[null,null,null,null,null,null,null,null,null,null,null,null,null,null,"5600|51,72"]
[null,null,null,null,null,null,null,null,null,null,null,null,null,null,"5800|51,29"]
[null,null,null,null,null,null,null,null,null,null,null,null,null,null,"6000|51,07"]
[null,null,null,null,null,null,null,null,null,null,null,null,null,null,"6200|50,32"]
[null,null,null,null,null,null,null,null,null,null,null,null,null,null,"6400|50,68"]
[]
[null,null,null,null,null,null,null,null,null,null,null,null,null,null,"6800|48,93"]
[null,null,null,null,null,null,null,null,null,null,null,null,null,null,"7000|48,71"]
[null,null,null,null,null,null,null,null,null,null,null,null,null,null,"7200|49,38"]
[null,null,null,null,null,null,null,null,null,null,null,null,null,null,"7400|49,42"]
[null,null,null,null,null,null,null,null,null,null,null,null,null,null,"7600|47,25"]
[null,null,null,null,null,null,null,null,null,null,null,null,null,null,"7800|47,97"]
[null,null,null,null,null,null,null,null,null,null,null,null,null,null,"8000|47,04"]
[]
[null,null,null,null,null,null,null,null,null,null,null,null,null,null,"8400|47,25"]
[null,null,null,null,null,null,null,null,null,null,null,null,null,null,"8600|44,76"]
[null,null,null,null,null,null,null,null,null,null,null,null,null,null,"8800|45,3"]
[null,null,null,null,null,null,null,null,null,null,null,null,null,null,"9000|45,24","13°","250us"]
[null,null,null,null,null,null,null,null,null,null,null,null,null,null,"9200|46,08"]
[null,null,null,null,null,null,null,null,null,null,null,null,null,null,"9400|45,84"]
[null,null,null,null,null,null,null,null,null,null,null,null,null,null,"9600|45,12"]
[null,null,null,null,null,null,null,null,null,null,null,null,null,null,"9800|45,36"]
[null,null,null,null,null,null,null,null,null,null,null,null,null,null,"10000|42,58"]