{"text_format":"1","workbook":"xlsx","n_sheets":14,"sheets":["README","Advance_curve","advance_at_lowRPM","VeryLowRPM","EEPROM16","Accuracy","formules","TIMERS","Calculs","Dwell variable","Version","Excel","calibrage","Error"],"not_rendered":{"charts":4,"images":3,"macros":0,"external_links":0,"defined_names":2,"comments":6,"pivot_tables":0},"unopened":[],"bounds":{"document_bytes":16777216,"sheet_cells":100000,"rows_first":2000,"rows_last":500,"rows_between":2000,"halvings":0,"cell_chars":16384,"cell_head_chars":4096},"cells_cut":0,"cells_raw":0,"read":"whole","date_system":"1900"}

{"sheet":"README","index":0,"n_rows":17,"n_cols":8,"rows_kept":17,"cut":false,"hidden":false,"merged":[]}
[]
[null,"With the values you have type in, the CDI behavior will be as the following:"]
[]
[null,null,null,null,null,null,null,"Where to change that?"]
[]
["A) ",{"$f":"CONCATENATE(\"0 degrees \",VeryLowRPM!B2)","v":"0 degrees advance from 91 to 480 RPM"},null,null,null,null,null,"default behavior, Can be altered by changing cell C11 in VeryLowRPM tab"]
[]
["B)",{"$f":"CONCATENATE(\"Flat advance from \",advance_at_lowRPM!Z7,\" to \",Advance_curve!D103,\"RPM\")","v":"Flat advance from 480 to 1001RPM"},null,null,null,null,null,"cell I2 in tab \"advance_at_lowRPM\""]
[]
["C)",{"$f":"CONCATENATE(\"Advance curve is freely adjustable from \",Advance_curve!D103, \" to \",Advance_curve!D11,\"RPM\")","v":"Advance curve is freely adjustable from 1001 to 4687RPM"},null,null,null,null,null,"column F in tab \"Advance_curve\""]
{"$rows_left_out":8}
{"sheet":"Advance_curve","index":1,"n_rows":335,"n_cols":26,"rows_kept":335,"cut":false,"hidden":false,"merged":[[7,9,7,10]]}
["05/02/2021",null,null,"Version DC-CDI v79r7c11",null,null,null,null,1,79,7,11]
[null,"Proc:","16F1827"]
[null,"Clock:",16,"MHz",null,"1 i",null,null,"incompressible",null,null,"Step"]
[null,"Fosc/4",{"$f":"C3/4","v":4},"MHz",null,"pickup position",null,null,"delay (us)",null,null,"(us)"]
[null,"TMR1h max",{"$f":"MAX(B173:B335)","v":117},null,null,50,"degrees BTDC",null,390,null,null,40]
[null,"Frq min",{"$f":"MIN(D174:D335)","v":16.693376068376068},null,null,{"$f":"IF(MAX(L9:L103)>254,\"Some cells warn. Increase STEP cell L5 ?\",\"\")","v":""}]
[null,"RPM min",{"$f":"MIN(D175:D335)","v":16.693376068376068},null,null,"4 i",null,null,null,null,null,{"$f":"IF(ISERROR(L9),\"Load DECHEX macro\",\"\")","v":""}]
[null,"TIMER1H count","Frq\n(Hz)","RPM","time for 1° (µs)","Advance (degrees)","Delay needed (ms)","Delay nedeed (µs)","Delay to wait (µs)","Correct\n(us)",null,"Values for\nthe map"]
["3 g",23,{"$f":"IFERROR(1000000/(B9*256*($O$30/$C$4)),\"\")","v":84.918478260869563},{"$f":"INT(60*C9*$O$25/2*$O$24)","v":5095},{"$f":"((1000*1000*60)/($O$24*$D9))/360","v":32.711808963035658},45.779600000000002,{"$f":"(E9*($F$5-F9))/1000","v":0.13805691854759561},{"$f":"E9*($F$5-F9)","v":138.05691854759561},{"$f":"IF($H9>$I$5,INT($H9-$I$5),\"0\")","v":"0"},0,{"$f":"IF(($I9/$L$5)-$J9>255,255,IF($I9>0.01,INT($I9-$J9)/$L$5,1))","v":0},{"$f":"IF($K9 > 0,$K9,0)","v":0},{"$f":"IF($I9/$L$5>255,CONCATENATE(\"WARNING: Timing will be more then \",F9,\"°\"),\"\")","v":""},null,null,null,null,null,null,null,null,null,null,null,null,{"$f":"CONCATENATE(L9,\"         ;\",ROUND(#REF!,0),\"rpm | \",ROUND(F9,1),\"° | \",,ROUND(G9,2),\"ms \")","v":{"$error":"#REF!"}}]
[{"$f":"IF($B10>255,CONCATENATE(\"ERROR: Timer1H too large\"),\"\")","v":""},{"$f":"IF((B9+1)<(95+$B$9),B9+1,\"- End -\")","v":24},{"$f":"IFERROR(1000000/(B10*256*($O$30/$C$4)),\"\")","v":81.380208333333329},{"$f":"INT(60*C10*$O$25/2*$O$24)","v":4882},34.139014065273798,42.889159999999997,0.24275706677591166,242.75706677591165,"0",0,{"$f":"IF(($I10/$L$5)-$J10>255,255,IF($I10>0.01,INT($I10-$J10)/$L$5,1))","v":0},{"$f":"IF($K10 > 0,$K10,0)","v":0},{"$f":"IF($I10/$L$5>255,CONCATENATE(\"WARNING: Timing will be more then \",F10,\"°\"),\"\")","v":""},null,null,null,null,null,null,null,null,null,null,null,null,{"$f":"CONCATENATE(L10,\"         ;\",ROUND(#REF!,0),\"rpm | \",ROUND(F10,1),\"° | \",,ROUND(G10,2),\"ms \")","v":{"$error":"#REF!"}}]
{"$rows_left_out":326}
{"sheet":"advance_at_lowRPM","index":2,"n_rows":49,"n_cols":26,"rows_kept":49,"cut":false,"hidden":false,"merged":[[0,6,0,7]]}
[null,null,null,null,null,null,"delay =",null,4.4000000000000004,"us"]
[null,"Advance at low RPM",null,{"$f":"CONCATENATE(\"from \",Z7,\" to\")","v":"from 480 to"},{"$f":"CONCATENATE(ROUNDDOWN(Advance_curve!D103,0),\" RPM\")","v":"1001 RPM"},null,null,"multiplier",14,null,null,null,null,null,{"$f":"Advance_curve!$F$5","v":50},"pickup pos"]
[null,null,null,null,null,null,null,null,null,null,null,null,null,null,{"$f":"Advance_curve!$B9","v":23},"tmr count min"]
[null,null,null,null,null,null,null,"Prescaler =",{"$f":"Advance_curve!O30","v":8},null,null,null,null,null,null,null,null,null,null,null,null,null,{"$f":"IF(R8<255,\"=(360000/P8)*T8\",0)","v":0}]
[null,null,null,null,null,null,null,"Cylinder(s) =",{"$f":"Advance_curve!O24","v":1}]
[null,null,null,null,null,null,null,"Strokes =",{"$f":"Advance_curve!O25","v":2},null,null,null,null,"Frq","RPM","periode","periode","timer1","TMR1h","Delay","1°","Avance","Avance",null,null,"Mini:"]
[null,null,null,null,null,null,null,"RPM mini =",{"$f":"IF(Advance_curve!O30=1,\"336\",IF(Advance_curve!O30=2,\"168\",IF(Advance_curve!O30=4,\"84\",IF(Advance_curve!O30=8,\"42\",\"False\"))))","v":"42"},null,null,null,null,"Hz",null,"µs","ms",null,null,"µs","us","degres","degres",null,null,{"$f":"MIN(Z8:Z49)","v":480}]
[null,null,null,null,null,null,null,null,null,null,null,null,null,1,{"$f":"IF(N8=\"End\",\" \",(N8*60*$I$6)/(2*$I$5))","v":60},{"$f":"1000000/N8","v":1000000},{"$f":"P8/1000","v":1000},{"$f":"IF(N8=\"End\",\" \",INT(P8*Advance_curve!$C$4)/$I$4)","v":500000},{"$f":"IF(N8=\"End\",\" \",R8/255)","v":1960.7843137254902},{"$f":" ($I$1 *$S8*$I$2)","v":120784.31372549021},{"$f":"P8/360","v":2777.7777777777778},{"$f":"T8/U8","v":43.482352941176472},{"$f":"IF($S8<255,Advance_curve!$F$5-V8,\"0\")","v":"0"},{"$f":"IF($S8<255,\" \",\"TMR1h>255\")","v":"TMR1h>255"},null,{"$f":"IF($S8<255,O8,\" \")","v":" "}]
[null,null,null,null,null,null,null,null,null,null,null,null,null,{"$f":"IF(N8<Advance_curve!$C$103,N8+1,\"End\")","v":2},120,{"$f":"1000000/N9","v":500000},{"$f":"P9/1000","v":500},{"$f":"IF(N9=\"End\",\" \",INT(P9*Advance_curve!$C$4)/$I$4)","v":250000},{"$f":"IF(N9=\"End\",\" \",R9/255)","v":980.39215686274508},{"$f":" ($I$1 *$S9*$I$2)","v":60392.156862745105},1388.8888888888889,{"$f":"T9/U9","v":43.482352941176472},{"$f":"IF($S9<255,Advance_curve!$F$5-V9,\"0\")","v":"0"},{"$f":"IF($S9<255,\" \",\"TMR1h>255\")","v":"TMR1h>255"},null," "]
[null,null,null,null,null,null,null,null,null,null,null,null,null,{"$f":"IF(N9<Advance_curve!$C$103,N9+1,\"End\")","v":3},180,333333.33333333331,333.33333333333331,{"$f":"IF(N10=\"End\",\" \",INT(P10*Advance_curve!$C$4)/$I$4)","v":166666.625},653.59460784313728,40261.427843137259,925.92592592592587,43.482342070588246,{"$f":"IF($S10<255,Advance_curve!$F$5-V10,\"0\")","v":"0"},"TMR1h>255",null," "]
{"$rows_left_out":40}
{"sheet":"VeryLowRPM","index":3,"n_rows":11,"n_cols":7,"rows_kept":11,"cut":false,"hidden":false,"merged":[]}
[]
[null,{"$f":"CONCATENATE(\"advance from \",E9,\" to \",advance_at_lowRPM!Z7,\" RPM\")","v":"advance from 91 to 480 RPM"}]
[null,null,null,null,null,null,"Si une periode entre 2 pkp fait 131ms pour 360°"]
[null,"Prescaler",{"$f":"Advance_curve!O30","v":8},null,null,null,"alors 50° (pkp position) sont parcourus en 131/360*50 = 18ms"]
[null,"clock",{"$f":"Advance_curve!C3","v":16},null,null,null,"Si on attend 18ms x TMR1DEB on spark pile au TDC."]
[null,"periode TMR1L",{"$f":"4*C4/C5","v":2},null,5,"debords max"]
[null,"TMR1",{"$f":"65536*C6/1000","v":131.072},"ms",{"$f":"E6*C7","v":655.36},"ms max"]
[null,"pkp position",{"$f":"Advance_curve!F5","v":50},"deg",{"$f":"1000/E7","v":1.52587890625},"Hz min","If one period between 2 pickups last 131ms for 360°"]
[null,"Time from pickup position to TDC",{"$f":"(C7/360)*C8+C11","v":18.204444444444444},"ms",{"$f":"INT(60*E8)","v":91},"rpm min","then 50° (which is the pickup position) are travelled in 131/360 * 50 = 18ms"]
[null,null,null,null,null,null,"If the processor waits 18ms * TMR1DEB (Number of Timer1 overflows) than spark append just at TDC"]
{"$rows_left_out":2}
{"sheet":"EEPROM16","index":4,"n_rows":66,"n_cols":24,"rows_kept":66,"cut":false,"hidden":false,"merged":[]}
[null,null,null,null,null,null,null,null,null,null,null,null,null,null,"INTEL 16HEX format",null,"RAW format"]
[null,null,null,null,null,null,null,null,null,null,null,null,null,null,":020000040000FA"]
["Bytes\n in\nRow","Address\nMSB (hex)","Address\nLSB (hex)","Address Start (MSB)","Address\nStart\n(LSB)","+0","+1","+2","+3","+4","+5","+6","+7",null,":020000040001F9",null,null,null,"sum[dec]","sum[hex]","LSB","two's\ncomplement [dec]","two's\ncomplement +1","cksum"]
[16,{"$f":"DEC2HEX(D4,2)","v":"E0"},{"$f":"DEC2HEX(E4,2)","v":"00"},224,0,{"$f":"Advance_curve!L9","v":0},{"$f":"Advance_curve!L10","v":0},{"$f":"Advance_curve!L11","v":0},{"$f":"Advance_curve!L12","v":1.2},{"$f":"Advance_curve!L13","v":3.55},{"$f":"Advance_curve!L14","v":5.8},{"$f":"Advance_curve!L15","v":8},{"$f":"Advance_curve!L16","v":10.15},null,{"$f":"\":\"&DEC2HEX(A4,2)&B4&C4&\"00\"&DEC2HEX(F4,2)&\"00\"&DEC2HEX(G4,2)&\"00\"&DEC2HEX(H4,2)&\"00\"&DEC2HEX(I4,2)&\"00\"&DEC2HEX(J4,2)&\"00\"&DEC2HEX(K4,2)&\"00\"&DEC2HEX(L4,2)&\"00\"&DEC2HEX(M4,2)&\"00\"&X4","v":":10E0000000000000000001000300050008000A00F4"},null,{"$f":"DEC2HEX(F4,2)&\" \"&DEC2HEX(G4,2)&\" \"&DEC2HEX(H4,2)&\" \"&DEC2HEX(I4,2)&\"   \"&DEC2HEX(J4,2)&\" \"&DEC2HEX(K4,2)&\" \"&DEC2HEX(L4,2)&\" \"&DEC2HEX(M4,2)","v":"00 00 00 01   03 05 08 0A"},null,{"$f":"SUM(A4,D4:M4)","v":268.7},{"$f":"DEC2HEX(S4)","v":"10C"},{"$f":"RIGHT(T4,2)","v":"0C"},{"$f":"255-HEX2DEC(U4)","v":243},{"$f":"V4+1","v":244},{"$f":"IF(W4=256,\"00\",DEC2HEX(W4,2))","v":"F4"}]
[16,{"$f":"DEC2HEX(D5,2)","v":"E0"},{"$f":"DEC2HEX(E5,2)","v":"10"},224,16,{"$f":"Advance_curve!L17","v":12.275},{"$f":"Advance_curve!L18","v":14.35},{"$f":"Advance_curve!L19","v":16.399999999999999},{"$f":"Advance_curve!L20","v":18.399999999999999},{"$f":"Advance_curve!L21","v":20.399999999999999},{"$f":"Advance_curve!L22","v":22.35},{"$f":"Advance_curve!L23","v":24.3},{"$f":"Advance_curve!L24","v":26.25},null,{"$f":"\":\"&DEC2HEX(A5,2)&B5&C5&\"00\"&DEC2HEX(F5,2)&\"00\"&DEC2HEX(G5,2)&\"00\"&DEC2HEX(H5,2)&\"00\"&DEC2HEX(I5,2)&\"00\"&DEC2HEX(J5,2)&\"00\"&DEC2HEX(K5,2)&\"00\"&DEC2HEX(L5,2)&\"00\"&DEC2HEX(M5,2)&\"00\"&X5","v":":10E010000C000E00100012001400160018001A0066"},null,"0C 0E 10 12   14 16 18 1A",null,{"$f":"SUM(A5,D5:M5)","v":410.72499999999997},{"$f":"DEC2HEX(S5)","v":"19A"},{"$f":"RIGHT(T5,2)","v":"9A"},{"$f":"255-HEX2DEC(U5)","v":101},102,"66"]
[16,"E0","20",224,32,{"$f":"Advance_curve!L25","v":28.175000000000001},{"$f":"Advance_curve!L26","v":30.074999999999999},{"$f":"Advance_curve!L27","v":31.95},{"$f":"Advance_curve!L28","v":33.825000000000003},{"$f":"Advance_curve!L29","v":35.700000000000003},{"$f":"Advance_curve!L30","v":37.549999999999997},{"$f":"Advance_curve!L31","v":39.375},{"$f":"Advance_curve!L32","v":41.225000000000001},null,":10E020001C001E001F0021002300250027002900DB",null,"1C 1E 1F 21   23 25 27 29",null,{"$f":"SUM(A6,D6:M6)","v":549.875},"225","25",218,219,"DB"]
[16,"E0","30",224,48,{"$f":"Advance_curve!L33","v":43.075000000000003},{"$f":"Advance_curve!L34","v":44.9},{"$f":"Advance_curve!L35","v":46.7},{"$f":"Advance_curve!L36","v":48.524999999999999},{"$f":"Advance_curve!L37","v":50.325000000000003},{"$f":"Advance_curve!L38","v":52.125},{"$f":"Advance_curve!L39","v":53.9},{"$f":"Advance_curve!L40","v":55.7},null,":10E030002B002C002E003000320034003500370055",null,"2B 2C 2E 30   32 34 35 37",null,{"$f":"SUM(A7,D7:M7)","v":683.25},"2AB","AB",84,85,"55"]
[16,"E0","40",224,64,{"$f":"Advance_curve!L41","v":57.5},{"$f":"Advance_curve!L42","v":59.274999999999999},{"$f":"Advance_curve!L43","v":61.075000000000003},{"$f":"Advance_curve!L44","v":62.825000000000003},{"$f":"Advance_curve!L45","v":64.599999999999994},{"$f":"Advance_curve!L46","v":66.349999999999994},{"$f":"Advance_curve!L47","v":68.125},{"$f":"Advance_curve!L48","v":69.875},null,":10E0400039003B003D003E004000420044004500D3",null,"39 3B 3D 3E   40 42 44 45",null,813.625,"32D","2D",210,211,"D3"]
[16,"E0","50",224,80,{"$f":"Advance_curve!L49","v":71.625},{"$f":"Advance_curve!L50","v":73.400000000000006},{"$f":"Advance_curve!L51","v":75.2},{"$f":"Advance_curve!L52","v":76.924999999999997},{"$f":"Advance_curve!L53","v":78.650000000000006},{"$f":"Advance_curve!L54","v":80.424999999999997},{"$f":"Advance_curve!L55","v":82.15},{"$f":"Advance_curve!L56","v":83.9},null,":10E05000470049004B004C004E0050005200530052",null,"47 49 4B 4C   4E 50 52 53",null,942.27499999999986,"3AE","AE",81,82,"52"]
[16,"E0","60",224,96,{"$f":"Advance_curve!L57","v":85.65},{"$f":"Advance_curve!L58","v":87.4},{"$f":"Advance_curve!L59","v":89.125},{"$f":"Advance_curve!L60","v":90.9},{"$f":"Advance_curve!L61","v":92.625},{"$f":"Advance_curve!L62","v":94.375},{"$f":"Advance_curve!L63","v":96.125},{"$f":"Advance_curve!L64","v":97.825000000000003},null,":10E060005500570059005A005C005E0060006100D2",null,"55 57 59 5A   5C 5E 60 61",null,1070.0249999999999,"42E","2E",209,210,"D2"]
{"$rows_left_out":57}
{"sheet":"Accuracy","index":5,"n_rows":16,"n_cols":3,"rows_kept":16,"cut":false,"hidden":false,"merged":[]}
["CYLINDRE:",1,"cyl"]
["STROKES",2,"stk"]
["ACCURACY",3.4,"us"]
[]
["RPM","ERROR"]
[0,0]
[1000,{"$f":"$B$3/((1000*(60*$B$2)/(2*$B$1*$A7))/0.36)","v":2.0399999999999998E-2}]
[2000,{"$f":"$B$3/((1000*(60*$B$2)/(2*$B$1*$A8))/0.36)","v":4.0799999999999996E-2}]
[3000,6.1199999999999997E-2]
[4000,8.1599999999999992E-2]
{"$rows_left_out":7}
{"sheet":"formules","index":6,"n_rows":48,"n_cols":18,"rows_kept":48,"cut":false,"hidden":false,"merged":[[13,8,13,9],[13,12,13,13],[13,14,13,15],[14,14,14,15],[0,8,0,9],[45,2,45,5],[45,6,45,9],[46,6,46,9],[46,2,46,5],[47,2,47,9]]}
[null,null,"TEMPS","CYLINDRE","RPM","FREQUENCE","PERIODE","PERIODE","1°",null,"durée =","degrés","relatif\npickup"]
[null,null,"Nbr","Nbr","tr/mn","Hz","ms","pour 2cyl 2tps","ms","us","us",null,{"$f":"Advance_curve!F5","v":50}]
[null,null,2,1,4000,{"$f":"(2*$D$3*$E$3)/(60*$C$3)","v":66.666666666666671},{"$f":"1000*(60*$C$3)/(2*$D$3*$E$3)","v":15},{"$f":"1000*60/$E$3","v":15},{"$f":"G3/360","v":4.1666666666666664E-2},{"$f":"G3/0.36","v":41.666666666666671},1884,{"$f":"K3/J3","v":45.215999999999994},{"$f":"L3-Advance_curve!F5","v":-4.784000000000006}]
[]
[null,null,null,null,{"$f":"(60*$F$5*$C$3)/(2*$D$3)","v":7200},120,{"$f":"1000*(60*$C$3)/(2*$D$3*$E$5)","v":8.3333333333333339},{"$f":"1000*60/$E$5","v":8.3333333333333339},{"$f":"G5/360","v":2.314814814814815E-2},{"$f":"G5/0.36","v":23.148148148148152},null,"FRQ = (2*CYL*RPM) / (60*TEMPS)"]
[null,null,null,null,null,null,null,null,null,null,null,"RPM = (60*FRQ*TEMPS) / ( 2*CYL)"]
[null,null,null,null,"Délai","=>","Délai","Avance",null,null,null,"1degré = (1000*1000*60*CYL) / ( 2*TEMPS*RPM)/360"]
[null,null,null,null,"us",null,"°","°",null,null,null,"RPM= 60*1000000/ TMR1*256*presc/Fosc"]
[null,null,null,null,1200,null,{"$f":"E9/J3","v":28.799999999999997},{"$f":"Advance_curve!F5 -G9","v":21.200000000000003},null,null,null,"TMR1=(PER*Fosc)/ presc*255"]
[null,null,null,null,null,null,null,null,null,null,null,"FRQ = 1/TMR1H = 1/TMR1H * (255 * PRES/Fosc) = 1*1000000 / TMR1H* (255 * PRES/Fosc) "]
{"$rows_left_out":39}
{"sheet":"TIMERS","index":7,"n_rows":43,"n_cols":12,"rows_kept":43,"cut":false,"hidden":false,"merged":[]}
["16F1847"]
[]
[null,"TIMER 0 et TIMER2/4/6"]
[null,"Quartz a 4MHz",null,null,null,null,null,"Clock =",16,"MHz",null,"4MHz"]
[null,"- Fosc/4 or 4MHz/4 = 1MHz",null,null,null,null,null,"Instruction clock =",{"$f":"I4/4","v":4},"MHz"]
[null,"- Prescaler sur 256 dans le registre T0CON",null,null,null,null,null,"Instruction clock =",{"$f":"1/I5","v":0.25},"us"]
[null,"- period of the frequency input to Timer 0 :"]
[null,"1/(1MHz/256) = 256us",null,null,null,null,null,"Prescaler Timer0 de 8bits ",256,null,null,256]
[null,"This is the period of time for each count in Timer 0 i.e.",null,null,null,null,null,"Periode  Timer0",{"$f":"(I8/$I$5)","v":64},"µs"]
[null,"256 * 256us = 65536us = 65.636ms = 15.26Hz",null,null,null,null,null,"Débordement TMR0",{"$f":"256*I9","v":16384},"µs"]
{"$rows_left_out":34}
{"sheet":"Calculs","index":8,"n_rows":38,"n_cols":6,"rows_kept":38,"cut":false,"hidden":false,"merged":[]}
[]
["- Tant que pickup est bas (=0) 99% du temps, on met la valeur du TIMER0 dans la variable PERL (PERiode Low)"]
["- Chaque fois que TIMER0 provoque une INTerruption de debordement lorsqu'il arrive a 255,  dans la routine d'interruption on incremente TMR0H (TIMER0 High)"]
["- Quand le pickup est haut (=1) (pulse) :"]
["- on memorise la valeur de TMR0H (Nbr de debordements de TIMER0), dans PERH (PERiode High)"]
["- et on memorise aussi la valeur du TIMER0 dans la variable PERL."]
["- puis on RAZ les timers,"]
[]
["- Ainsi la durée ecoulé entre 2 pickups est stockée dans PERL et PERH.   Soit : (PERH x 255 ) + PERL"]
[]
{"$rows_left_out":29}
{"sheet":"Dwell variable","index":9,"n_rows":98,"n_cols":5,"rows_kept":98,"cut":false,"hidden":false,"merged":[]}
[]
[null,null,null,"coef:","DWELL = PERIODE * 50"]
[null,{"$f":"Advance_curve!B8","v":"TIMER1H count"},null,50]
[null,{"$f":"Advance_curve!B9","v":23},{"$f":"$D$3*Advance_curve!B9","v":1150},"µs"]
[null,{"$f":"Advance_curve!B10","v":24},{"$f":"$D$3*Advance_curve!B10","v":1200}]
[null,{"$f":"Advance_curve!B11","v":25},{"$f":"$D$3*Advance_curve!B11","v":1250}]
[null,{"$f":"Advance_curve!B12","v":26},{"$f":"$D$3*Advance_curve!B12","v":1300}]
[null,{"$f":"Advance_curve!B13","v":27},{"$f":"$D$3*Advance_curve!B13","v":1350}]
[null,{"$f":"Advance_curve!B14","v":28},{"$f":"$D$3*Advance_curve!B14","v":1400}]
[null,{"$f":"Advance_curve!B15","v":29},{"$f":"$D$3*Advance_curve!B15","v":1450}]
{"$rows_left_out":89}
{"sheet":"Version","index":10,"n_rows":62,"n_cols":2,"rows_kept":62,"cut":false,"hidden":false,"merged":[]}
[]
[]
[]
["v7.9r13c2","[HARD] Correction RA1 forcé a 1, car pullup R5 sur PCB"]
["v7.9r13c3","[XLS] Valeur de dwell passe de 2 choix (500,1000) a 6 choix (500,1000,2000,3000,4000,5000)."]
["v7.9r14c0","[SOFT,XLS] Ajout d'une valeur de dwell \"AUTO\" pour lequel la durée de dwell est proportionnelle a PERIODE."]
["v7.9r14c1","[SOFT] Code protection OFF"]
["v7.9r15c0","[XLS] La vlaleur d'avance affichée dans l'onglet \"advance_at_lowRPM\" ne prenait pas en compte la position du pickup, c'était donc une valeur RELATIVE, pas ABSOLUE. Multiplicateur peut descendre a 1 (soft OK)"]
[null,"[SOFT] si JP2 a la masse alors PIC bypass la courbe d'avance et envoi spark dés que detection front descendant du pickup"]
[null,"[SOFT] RB3 (ex TP2) n'était pas forcé en OUTPUT"]
{"$rows_left_out":53}
{"sheet":"Excel","index":11,"n_rows":10,"n_cols":3,"rows_kept":10,"cut":false,"hidden":false,"merged":[]}
[]
[]
["Conversion de valeurs: ",null,"=SI(I2=2;2;(SI(I2=3;3;(SI(I2=4;4;(SI(I2=5;5;(SI(I2=6;6)))))))))"]
[]
["Liste deroulante: ",null,"Donnees> Validite des donnees"]
[]
[]
["les graphes n'affichent pas la valeur #N/A  , utiliser #N/A pour faire disparaitre les points du graphe"]
[]
["Pour afficher les liens d'une cellule: selectionnez-la > Formule > Reperer les antécédents/dependants "]
{"$rows_left_out":1}
{"sheet":"calibrage","index":12,"n_rows":36,"n_cols":12,"rows_kept":36,"cut":false,"hidden":false,"merged":[]}
[]
[null,"RPM","HZ","ms","us","1°","XLS","nb loop","Tester","Ecart","Ecart","Ecart/loop"]
[1,1000,{"$f":"(2*formules!$D$3*B3)/(60*formules!$C$3)","v":16.666666666666668},{"$f":"1000*(60*formules!$C$3)/(2*formules!$D$3*B3)","v":60},{"$f":"D3*1000","v":60000},"us","°btdc",null,"°btdc","°","us","us"]
[2,1500,{"$f":"(2*formules!$D$3*B4)/(60*formules!$C$3)","v":25},{"$f":"1000*(60*formules!$C$3)/(2*formules!$D$3*B4)","v":40},{"$f":"D4*1000","v":40000}]
[3,2000,{"$f":"(2*formules!$D$3*B5)/(60*formules!$C$3)","v":33.333333333333336},{"$f":"1000*(60*formules!$C$3)/(2*formules!$D$3*B5)","v":30},30000]
[4,2500,{"$f":"(2*formules!$D$3*B6)/(60*formules!$C$3)","v":41.666666666666664},{"$f":"1000*(60*formules!$C$3)/(2*formules!$D$3*B6)","v":24},24000]
[5,3000,{"$f":"(2*formules!$D$3*B7)/(60*formules!$C$3)","v":50},{"$f":"1000*(60*formules!$C$3)/(2*formules!$D$3*B7)","v":20},20000,56,34,36,27,{"$f":"G7-I7","v":7},{"$f":"J7*F7","v":392},{"$f":"K7/H7","v":10.888888888888889}]
[6,3500,{"$f":"(2*formules!$D$3*B8)/(60*formules!$C$3)","v":58.333333333333336},{"$f":"1000*(60*formules!$C$3)/(2*formules!$D$3*B8)","v":17.142857142857142},17142.857142857141]
[7,4000,{"$f":"(2*formules!$D$3*B9)/(60*formules!$C$3)","v":66.666666666666671},{"$f":"1000*(60*formules!$C$3)/(2*formules!$D$3*B9)","v":15},15000]
[8,4500,{"$f":"(2*formules!$D$3*B10)/(60*formules!$C$3)","v":75},{"$f":"1000*(60*formules!$C$3)/(2*formules!$D$3*B10)","v":13.333333333333334},13333.333333333334]
{"$rows_left_out":27}
{"sheet":"Error","index":13,"n_rows":50,"n_cols":17,"rows_kept":50,"cut":false,"hidden":false,"merged":[]}
[null,"prescaler: 8","step 40us","data= ZERO","Pkp position: 60"]
[]
[]
[null,null,null,null,null,null,null,null,null,null,null,null,null,null,null,"En theorie la ligne devrait etre droite a 60°"]
[null,null,null,null,null,null,null,null,null,null,null,null,null,null,"1000|12,96","il y a un délai FIXE de 250us c'est le temps de démarrage du DC converter du Tester v5"]
[null,null,null,null,null,null,null,null,null,null,null,null,null,null,"1200|58,24"]
[null,null,null,null,null,null,null,null,null,null,null,null,null,null,"1400|57,99"]
[null,null,null,null,null,null,null,null,null,null,null,null,null,null,"1600|57,71"]
[]
[null,null,null,null,null,null,null,null,null,null,null,null,null,null,"2000|57,26"]
{"$rows_left_out":40}